BDBM50314991 CHEMBL1089524::N-(4-(3-Bromophenylamino)quinolin-6-yl)-4-(dimethylamino)-butanamide
SMILES: CN(C)CCCC(=O)Nc1ccc2nccc(Nc3cccc(Br)c3)c2c1
InChI Key: InChIKey=PHFAEZLTGYDQNR-UHFFFAOYSA-N
Data: 1 IC50
Activity Spreadsheet -- Enzyme Inhibition Constant Data from BindingDB
Found 1 hit for monomerid = 50314991
Trg + Lig
Ki
nM
ΔG°
kcal/mole
IC50
nM
Kd
nM
EC50/IC50
nM
koff
s-1
kon
M-1s-1
pHTemp
°C
Epidermal growth factor receptor
(Homo sapiens (Human))
BDBM50314991
(CHEMBL1089524 | N-(4-(3-Bromophenylamino)quinolin-...)
Show SMILES CN(C)CCCC(=O)Nc1ccc2nccc(Nc3cccc(Br)c3)c2c1
Show InChI InChI=1S/C21H23BrN4O/c1-26(2)12-4-7-21(27)25-17-8-9-19-18(14-17)20(10-11-23-19)24-16-6-3-5-15(22)13-16/h3,5-6,8-11,13-14H,4,7,12H2,1-2H3,(H,23,24)(H,25,27)
n/an/a 1.70n/an/an/an/an/an/a
Chemical Genomics Centre of the Max Planck Society
Curated by ChEMBL
Assay Description
Inhibition of wild type EGFR by HTRF assay
J Med Chem 53: 2892-901 (2010)
Article DOI: 10.1021/jm901877j
BindingDB Entry DOI: 10.7270/Q2T43T7N