BDBM50315009 4-(1-((6-aminopyridin-2-yl)methyl)-5-phenyl-1H-pyrrol-2-yl)-N-propylbenzamide::CHEMBL1090146
SMILES: CCCNC(=O)c1ccc(cc1)-c1ccc(-c2ccccc2)n1Cc1cccc(N)n1
InChI Key: InChIKey=XQBNJCIXEUWCLY-UHFFFAOYSA-N
Data: 2 IC50
Activity Spreadsheet -- Enzyme Inhibition Constant Data from BindingDB
Found 2 hits for monomerid = 50315009
Trg + Lig
Ki
nM
ΔG°
kcal/mole
IC50
nM
Kd
nM
EC50/IC50
nM
koff
s-1
kon
M-1s-1
pHTemp
°C
Cathepsin D
(Homo sapiens (Human))
BDBM50315009
(4-(1-((6-aminopyridin-2-yl)methyl)-5-phenyl-1H-pyr...)
Show SMILES CCCNC(=O)c1ccc(cc1)-c1ccc(-c2ccccc2)n1Cc1cccc(N)n1
Show InChI InChI=1S/C26H26N4O/c1-2-17-28-26(31)21-13-11-20(12-14-21)24-16-15-23(19-7-4-3-5-8-19)30(24)18-22-9-6-10-25(27)29-22/h3-16H,2,17-18H2,1H3,(H2,27,29)(H,28,31)
NCI pathway
Reactome pathway
n/an/a 4.43E+4n/an/an/an/an/an/a
Princ
Curated by ChEMBL
Assay Description
Inhibition of cathepsin D by FRET assay
Bioorg Med Chem Lett 20: 2068-73 (2010)
Article DOI: 10.1016/j.bmcl.2010.02.075
BindingDB Entry DOI: 10.7270/Q2PG1RWS
Beta-secretase 1
(Homo sapiens (Human))
BDBM50315009
(4-(1-((6-aminopyridin-2-yl)methyl)-5-phenyl-1H-pyr...)
Show SMILES CCCNC(=O)c1ccc(cc1)-c1ccc(-c2ccccc2)n1Cc1cccc(N)n1
Show InChI InChI=1S/C26H26N4O/c1-2-17-28-26(31)21-13-11-20(12-14-21)24-16-15-23(19-7-4-3-5-8-19)30(24)18-22-9-6-10-25(27)29-22/h3-16H,2,17-18H2,1H3,(H2,27,29)(H,28,31)
n/an/a 3.00E+3n/an/an/an/an/an/a
Princ
Curated by ChEMBL
Assay Description
Inhibition of human recombinant BACE1 expressed CHO cells by FRET assay
Bioorg Med Chem Lett 20: 2068-73 (2010)
Article DOI: 10.1016/j.bmcl.2010.02.075
BindingDB Entry DOI: 10.7270/Q2PG1RWS