BDBM50315065 1-(4-(4-(3-oxa-8-azabicyclo[3.2.1]octan-8-yl)-6-(tetrahydro-2H-pyran-4-yl)-1,3,5-triazin-2-yl)phenyl)-3-(4-(4-ethylpiperazin-1-yl)phenyl)urea::CHEMBL1091352
SMILES: CCN1CCN(CC1)c1ccc(NC(=O)Nc2ccc(cc2)-c2nc(nc(n2)N2C3CCC2COC3)C2CCOCC2)cc1
InChI Key: InChIKey=DLKUYIIKKUMCAQ-UHFFFAOYSA-N
Data: 2 IC50
Activity Spreadsheet -- Enzyme Inhibition Constant Data from BindingDB
Found 2 hits for monomerid = 50315065
Trg + Lig
Ki
nM
ΔG°
kcal/mole
IC50
nM
Kd
nM
EC50/IC50
nM
koff
s-1
kon
M-1s-1
pHTemp
°C
Phosphatidylinositol 4,5-bisphosphate 3-kinase catalytic subunit alpha isoform
(Homo sapiens (Human))
BDBM50315065
(1-(4-(4-(3-oxa-8-azabicyclo[3.2.1]octan-8-yl)-6-(t...)
Show SMILES CCN1CCN(CC1)c1ccc(NC(=O)Nc2ccc(cc2)-c2nc(nc(n2)N2C3CCC2COC3)C2CCOCC2)cc1
Show InChI InChI=1S/C33H42N8O3/c1-2-39-15-17-40(18-16-39)27-9-7-26(8-10-27)35-33(42)34-25-5-3-23(4-6-25)30-36-31(24-13-19-43-20-14-24)38-32(37-30)41-28-11-12-29(41)22-44-21-28/h3-10,24,28-29H,2,11-22H2,1H3,(H2,34,35,42)
NCI pathway
Reactome pathway
n/an/a 574n/an/an/an/an/an/a
Wyeth Research
Curated by ChEMBL
Assay Description
Inhibition of PI3Kalpha after 15 to 30 mins by fluorescence polarization assay
Bioorg Med Chem Lett 20: 2648-53 (2010)
Article DOI: 10.1016/j.bmcl.2010.02.031
BindingDB Entry DOI: 10.7270/Q2DZ08GK
Serine/threonine-protein kinase mTOR
(Homo sapiens (Human))
BDBM50315065
(1-(4-(4-(3-oxa-8-azabicyclo[3.2.1]octan-8-yl)-6-(t...)
Show SMILES CCN1CCN(CC1)c1ccc(NC(=O)Nc2ccc(cc2)-c2nc(nc(n2)N2C3CCC2COC3)C2CCOCC2)cc1
Show InChI InChI=1S/C33H42N8O3/c1-2-39-15-17-40(18-16-39)27-9-7-26(8-10-27)35-33(42)34-25-5-3-23(4-6-25)30-36-31(24-13-19-43-20-14-24)38-32(37-30)41-28-11-12-29(41)22-44-21-28/h3-10,24,28-29H,2,11-22H2,1H3,(H2,34,35,42)
NCI pathway
Reactome pathway
n/an/a 0.560n/an/an/an/an/an/a
Wyeth Research
Curated by ChEMBL
Assay Description
Inhibition of mTOR
Bioorg Med Chem Lett 20: 2648-53 (2010)
Article DOI: 10.1016/j.bmcl.2010.02.031
BindingDB Entry DOI: 10.7270/Q2DZ08GK