BDBM50315073 1-(4-(4-(3-oxa-8-azabicyclo[3.2.1]octan-8-yl)-6-((R)-3-methylmorpholino)-1,3,5-triazin-2-yl)phenyl)-3-(4-(piperazin-1-yl)phenyl)urea::CHEMBL1091360
SMILES: C[C@@H]1COCCN1c1nc(nc(n1)-c1ccc(NC(=O)Nc2ccc(cc2)N2CCNCC2)cc1)N1C2CCC1COC2
InChI Key: InChIKey=FFOSMKDQFMVOLX-QJYLRPAKSA-N
Data: 2 IC50
Activity Spreadsheet -- Enzyme Inhibition Constant Data from BindingDB
Found 2 hits for monomerid = 50315073
Trg + Lig
Ki
nM
ΔG°
kcal/mole
IC50
nM
Kd
nM
EC50/IC50
nM
koff
s-1
kon
M-1s-1
pHTemp
°C
Phosphatidylinositol 4,5-bisphosphate 3-kinase catalytic subunit alpha isoform
(Homo sapiens (Human))
BDBM50315073
(1-(4-(4-(3-oxa-8-azabicyclo[3.2.1]octan-8-yl)-6-((...)
Show SMILES C[C@@H]1COCCN1c1nc(nc(n1)-c1ccc(NC(=O)Nc2ccc(cc2)N2CCNCC2)cc1)N1C2CCC1COC2 |r|
Show InChI InChI=1S/C31H39N9O3/c1-21-18-42-17-16-39(21)29-35-28(36-30(37-29)40-26-10-11-27(40)20-43-19-26)22-2-4-23(5-3-22)33-31(41)34-24-6-8-25(9-7-24)38-14-12-32-13-15-38/h2-9,21,26-27,32H,10-20H2,1H3,(H2,33,34,41)/t21-,26?,27?/m1/s1
NCI pathway
Reactome pathway
n/an/a 286n/an/an/an/an/an/a
Wyeth Research
Curated by ChEMBL
Assay Description
Inhibition of PI3Kalpha after 15 to 30 mins by fluorescence polarization assay
Bioorg Med Chem Lett 20: 2648-53 (2010)
Article DOI: 10.1016/j.bmcl.2010.02.031
BindingDB Entry DOI: 10.7270/Q2DZ08GK
Serine/threonine-protein kinase mTOR
(Homo sapiens (Human))
BDBM50315073
(1-(4-(4-(3-oxa-8-azabicyclo[3.2.1]octan-8-yl)-6-((...)
Show SMILES C[C@@H]1COCCN1c1nc(nc(n1)-c1ccc(NC(=O)Nc2ccc(cc2)N2CCNCC2)cc1)N1C2CCC1COC2 |r|
Show InChI InChI=1S/C31H39N9O3/c1-21-18-42-17-16-39(21)29-35-28(36-30(37-29)40-26-10-11-27(40)20-43-19-26)22-2-4-23(5-3-22)33-31(41)34-24-6-8-25(9-7-24)38-14-12-32-13-15-38/h2-9,21,26-27,32H,10-20H2,1H3,(H2,33,34,41)/t21-,26?,27?/m1/s1
NCI pathway
Reactome pathway
n/an/a 0.400n/an/an/an/an/an/a
Wyeth Research
Curated by ChEMBL
Assay Description
Inhibition of mTOR
Bioorg Med Chem Lett 20: 2648-53 (2010)
Article DOI: 10.1016/j.bmcl.2010.02.031
BindingDB Entry DOI: 10.7270/Q2DZ08GK