BDBM50315204 (R)-2-(6-methoxy-3-(1-(3-methoxypyrazin-2-yl)ethyl)-1H-inden-2-yl)-N,N-dimethylethanamine::CHEMBL1090186
SMILES: COc1ccc2C([C@@H](C)c3nccnc3OC)=C(CCN(C)C)Cc2c1
InChI Key: InChIKey=AIGMIQVSRPRWAQ-CQSZACIVSA-N
Data: 3 KI  3 IC50
Activity Spreadsheet -- Enzyme Inhibition Constant Data from BindingDB
Found 6 hits for monomerid = 50315204
Trg + Lig
Ki
nM
ΔG°
kcal/mole
IC50
nM
Kd
nM
EC50/IC50
nM
koff
s-1
kon
M-1s-1
pHTemp
°C
Histamine H1 receptor
(Homo sapiens (Human))
BDBM50315204
((R)-2-(6-methoxy-3-(1-(3-methoxypyrazin-2-yl)ethyl...)
Show SMILES COc1ccc2C([C@@H](C)c3nccnc3OC)=C(CCN(C)C)Cc2c1 |r,t:17|
Show InChI InChI=1S/C21H27N3O2/c1-14(20-21(26-5)23-10-9-22-20)19-15(8-11-24(2)3)12-16-13-17(25-4)6-7-18(16)19/h6-7,9-10,13-14H,8,11-12H2,1-5H3/t14-/m1/s1
Reactome pathway
1.30n/an/an/an/an/an/an/an/a
Neurocrine Biosciences
Curated by ChEMBL
Assay Description
Binding affinity at histamine H1 receptor
Bioorg Med Chem Lett 20: 2629-33 (2010)
Article DOI: 10.1016/j.bmcl.2010.02.055
BindingDB Entry DOI: 10.7270/Q2NG4QSV
Potassium voltage-gated channel subfamily H member 2
(Homo sapiens (Human))
BDBM50315204
((R)-2-(6-methoxy-3-(1-(3-methoxypyrazin-2-yl)ethyl...)
Show SMILES COc1ccc2C([C@@H](C)c3nccnc3OC)=C(CCN(C)C)Cc2c1 |r,t:17|
Show InChI InChI=1S/C21H27N3O2/c1-14(20-21(26-5)23-10-9-22-20)19-15(8-11-24(2)3)12-16-13-17(25-4)6-7-18(16)19/h6-7,9-10,13-14H,8,11-12H2,1-5H3/t14-/m1/s1
Reactome pathway
>3.00E+3n/an/an/an/an/an/an/an/a
Neurocrine Biosciences
Curated by ChEMBL
Assay Description
Displacement of dofetilide from human ERG
Bioorg Med Chem Lett 20: 2629-33 (2010)
Article DOI: 10.1016/j.bmcl.2010.02.055
BindingDB Entry DOI: 10.7270/Q2NG4QSV
Muscarinic acetylcholine receptor M1
(Homo sapiens (Human))
BDBM50315204
((R)-2-(6-methoxy-3-(1-(3-methoxypyrazin-2-yl)ethyl...)
Show SMILES COc1ccc2C([C@@H](C)c3nccnc3OC)=C(CCN(C)C)Cc2c1 |r,t:17|
Show InChI InChI=1S/C21H27N3O2/c1-14(20-21(26-5)23-10-9-22-20)19-15(8-11-24(2)3)12-16-13-17(25-4)6-7-18(16)19/h6-7,9-10,13-14H,8,11-12H2,1-5H3/t14-/m1/s1
>1.00E+4n/an/an/an/an/an/an/an/a
Neurocrine Biosciences
Curated by ChEMBL
Assay Description
Binding affinity at M1 receptor
Bioorg Med Chem Lett 20: 2629-33 (2010)
Article DOI: 10.1016/j.bmcl.2010.02.055
BindingDB Entry DOI: 10.7270/Q2NG4QSV
Potassium voltage-gated channel subfamily H member 2
(Homo sapiens (Human))
BDBM50315204
((R)-2-(6-methoxy-3-(1-(3-methoxypyrazin-2-yl)ethyl...)
Show SMILES COc1ccc2C([C@@H](C)c3nccnc3OC)=C(CCN(C)C)Cc2c1 |r,t:17|
Show InChI InChI=1S/C21H27N3O2/c1-14(20-21(26-5)23-10-9-22-20)19-15(8-11-24(2)3)12-16-13-17(25-4)6-7-18(16)19/h6-7,9-10,13-14H,8,11-12H2,1-5H3/t14-/m1/s1
Reactome pathway
n/an/a 5.00E+3n/an/an/an/an/an/a
Neurocrine Biosciences
Curated by ChEMBL
Assay Description
Inhibition of human ERG by patch clamp assay
Bioorg Med Chem Lett 20: 2629-33 (2010)
Article DOI: 10.1016/j.bmcl.2010.02.055
BindingDB Entry DOI: 10.7270/Q2NG4QSV
Cytochrome P450 3A4
(Homo sapiens (Human))
BDBM50315204
((R)-2-(6-methoxy-3-(1-(3-methoxypyrazin-2-yl)ethyl...)
Show SMILES COc1ccc2C([C@@H](C)c3nccnc3OC)=C(CCN(C)C)Cc2c1 |r,t:17|
Show InChI InChI=1S/C21H27N3O2/c1-14(20-21(26-5)23-10-9-22-20)19-15(8-11-24(2)3)12-16-13-17(25-4)6-7-18(16)19/h6-7,9-10,13-14H,8,11-12H2,1-5H3/t14-/m1/s1
Reactome pathway
n/an/a>1.00E+4n/an/an/an/an/an/a
Neurocrine Biosciences
Curated by ChEMBL
Assay Description
Inhibition of CYP3A4
Bioorg Med Chem Lett 20: 2629-33 (2010)
Article DOI: 10.1016/j.bmcl.2010.02.055
BindingDB Entry DOI: 10.7270/Q2NG4QSV
Cytochrome P450 2D6
(Homo sapiens (Human))
BDBM50315204
((R)-2-(6-methoxy-3-(1-(3-methoxypyrazin-2-yl)ethyl...)
Show SMILES COc1ccc2C([C@@H](C)c3nccnc3OC)=C(CCN(C)C)Cc2c1 |r,t:17|
Show InChI InChI=1S/C21H27N3O2/c1-14(20-21(26-5)23-10-9-22-20)19-15(8-11-24(2)3)12-16-13-17(25-4)6-7-18(16)19/h6-7,9-10,13-14H,8,11-12H2,1-5H3/t14-/m1/s1
n/an/a 1.90E+3n/an/an/an/an/an/a
Neurocrine Biosciences
Curated by ChEMBL
Assay Description
Inhibition of CYP2D6
Bioorg Med Chem Lett 20: 2629-33 (2010)
Article DOI: 10.1016/j.bmcl.2010.02.055
BindingDB Entry DOI: 10.7270/Q2NG4QSV