BDBM50315304 (R)-N-(2-Pyridinylmethyl)-N'-(1H-benzimidazol-2-ylmethyl)-N'-(5,6,7,8-tetrahydro-8-quinolinyl)-1,4-benzenedimethanamine::CHEMBL1090509
SMILES: C(NCc1ccccn1)c1ccc(CN(Cc2nc3ccccc3[nH]2)[C@@H]2CCCc3cccnc23)cc1
InChI Key: InChIKey=YPTODVXKEJXEET-GDLZYMKVSA-N
Data: 1 IC50
Activity Spreadsheet -- Enzyme Inhibition Constant Data from BindingDB
Found 1 hit for monomerid = 50315304
Trg + Lig
Ki
nM
ΔG°
kcal/mole
IC50
nM
Kd
nM
EC50/IC50
nM
koff
s-1
kon
M-1s-1
pHTemp
°C
C-X-C chemokine receptor type 4 (CXCR4)
(Homo sapiens (Human))
BDBM50315304
((R)-N-(2-Pyridinylmethyl)-N'-(1H-benzimidazol-2-yl...)
Show SMILES C(NCc1ccccn1)c1ccc(CN(Cc2nc3ccccc3[nH]2)[C@@H]2CCCc3cccnc23)cc1 |r|
Show InChI InChI=1S/C31H32N6/c1-2-11-28-27(10-1)35-30(36-28)22-37(29-12-5-7-25-8-6-18-34-31(25)29)21-24-15-13-23(14-16-24)19-32-20-26-9-3-4-17-33-26/h1-4,6,8-11,13-18,29,32H,5,7,12,19-22H2,(H,35,36)/t29-/m1/s1
n/an/a 2.92E+4n/an/an/an/an/an/a
Genzyme Corp.
Curated by ChEMBL
Assay Description
Inhibition of anti-CXCR4 12G5 monoclonal antibody to CXCR4 in human SUP-T1 cells pretreated for 30 mins by flow cytometry
J Med Chem 53: 3376-88 (2010)
Article DOI: 10.1021/jm100073m
BindingDB Entry DOI: 10.7270/Q2GQ6XW9