BDBM50315318 8-chloro-4-(5-methyl-2,5-diazabicyclo[2.2.2]octan-2-yl)benzofuro[3,2-d]pyrimidine::CHEMBL1092933
SMILES: CN1CC2CCC1CN2c1ncnc2c1oc1ccc(Cl)cc21
InChI Key: InChIKey=QQHWGWGTSDXWSQ-UHFFFAOYSA-N
Data: 1 IC50
Activity Spreadsheet -- Enzyme Inhibition Constant Data from BindingDB
Found 1 hit for monomerid = 50315318
Trg + Lig
Ki
nM
ΔG°
kcal/mole
IC50
nM
Kd
nM
EC50/IC50
nM
koff
s-1
kon
M-1s-1
pHTemp
°C
Histamine H4 receptor
(Homo sapiens (Human))
BDBM50315318
(8-chloro-4-(5-methyl-2,5-diazabicyclo[2.2.2]octan-...)
Show SMILES CN1CC2CCC1CN2c1ncnc2c1oc1ccc(Cl)cc21
Show InChI InChI=1S/C17H17ClN4O/c1-21-7-12-4-3-11(21)8-22(12)17-16-15(19-9-20-17)13-6-10(18)2-5-14(13)23-16/h2,5-6,9,11-12H,3-4,7-8H2,1H3
Reactome pathway
n/an/a 169n/an/an/an/an/an/a
Argenta Discovery Ltd.
Curated by ChEMBL
Assay Description
Displacement of [3H]histamine dihydrochloride from human histamine H4 receptor after 2.5 hrs by scintillation proximity assay
Bioorg Med Chem Lett 20: 2516-9 (2010)
Article DOI: 10.1016/j.bmcl.2010.02.097
BindingDB Entry DOI: 10.7270/Q2CN74V3