BDBM50315319 8-chloro-4-(8-methyl-3,8-diazabicyclo[3.2.1]octan-3-yl)benzofuro[3,2-d]pyrimidine::CHEMBL1092934
SMILES: CN1C2CCC1CN(C2)c1ncnc2c3cc(Cl)ccc3oc12
InChI Key: InChIKey=UHSBYBSNAGJIDG-UHFFFAOYSA-N
Data: 1 IC50
Activity Spreadsheet -- Enzyme Inhibition Constant Data from BindingDB
Found 1 hit for monomerid = 50315319
Trg + Lig
Ki
nM
ΔG°
kcal/mole
IC50
nM
Kd
nM
EC50/IC50
nM
koff
s-1
kon
M-1s-1
pHTemp
°C
Histamine H4 receptor
(Homo sapiens (Human))
BDBM50315319
(8-chloro-4-(8-methyl-3,8-diazabicyclo[3.2.1]octan-...)
Show SMILES CN1C2CCC1CN(C2)c1ncnc2c3cc(Cl)ccc3oc12
Show InChI InChI=1S/C17H17ClN4O/c1-21-11-3-4-12(21)8-22(7-11)17-16-15(19-9-20-17)13-6-10(18)2-5-14(13)23-16/h2,5-6,9,11-12H,3-4,7-8H2,1H3
Reactome pathway
n/an/a 440n/an/an/an/an/an/a
Argenta Discovery Ltd.
Curated by ChEMBL
Assay Description
Displacement of [3H]histamine dihydrochloride from human histamine H4 receptor after 2.5 hrs by scintillation proximity assay
Bioorg Med Chem Lett 20: 2516-9 (2010)
Article DOI: 10.1016/j.bmcl.2010.02.097
BindingDB Entry DOI: 10.7270/Q2CN74V3