BDBM50315346 8-chloro-4-(4-methylpiperazin-1-yl)benzofuro[3,2-d]pyrimidin-2-ol::CHEMBL1093438
SMILES: CN1CCN(CC1)c1[nH]c(=O)nc2c3cc(Cl)ccc3oc12
InChI Key: InChIKey=OYBVTWJHXOTAFX-UHFFFAOYSA-N
Data: 1 IC50
Activity Spreadsheet -- Enzyme Inhibition Constant Data from BindingDB
Found 1 hit for monomerid = 50315346
Trg + Lig
Ki
nM
ΔG°
kcal/mole
IC50
nM
Kd
nM
EC50/IC50
nM
koff
s-1
kon
M-1s-1
pHTemp
°C
Histamine H4 receptor
(Homo sapiens (Human))
BDBM50315346
(8-chloro-4-(4-methylpiperazin-1-yl)benzofuro[3,2-d...)
Show SMILES CN1CCN(CC1)c1[nH]c(=O)nc2c3cc(Cl)ccc3oc12
Show InChI InChI=1S/C15H15ClN4O2/c1-19-4-6-20(7-5-19)14-13-12(17-15(21)18-14)10-8-9(16)2-3-11(10)22-13/h2-3,8H,4-7H2,1H3,(H,17,18,21)
Reactome pathway
n/an/a 1.00E+3n/an/an/an/an/an/a
Argenta Discovery Ltd.
Curated by ChEMBL
Assay Description
Displacement of [3H]histamine dihydrochloride from human histamine H4 receptor after 2.5 hrs by scintillation proximity assay
Bioorg Med Chem Lett 20: 2516-9 (2010)
Article DOI: 10.1016/j.bmcl.2010.02.097
BindingDB Entry DOI: 10.7270/Q2CN74V3