BDBM50315436 (1S)-1,5-Anhydro-1-[4-chloro-3-(4-ethoxybenzyl)phenyl]-1-thio-D-glucitol::CHEMBL1091946
SMILES: CCOc1ccc(Cc2cc(ccc2Cl)[C@@H]2S[C@H](CO)[C@@H](O)[C@H](O)[C@H]2O)cc1
InChI Key: InChIKey=ZKPZKVITIGSNAY-ADAARDCZSA-N
Data: 2 IC50
Activity Spreadsheet -- Enzyme Inhibition Constant Data from BindingDB
Found 2 hits for monomerid = 50315436
Trg + Lig
Ki
nM
ΔG°
kcal/mole
IC50
nM
Kd
nM
EC50/IC50
nM
koff
s-1
kon
M-1s-1
pHTemp
°C
Sodium/glucose cotransporter 1 (SGLT1)
(Homo sapiens (Human))
BDBM50315436
((1S)-1,5-Anhydro-1-[4-chloro-3-(4-ethoxybenzyl)phe...)
Show SMILES CCOc1ccc(Cc2cc(ccc2Cl)[C@@H]2S[C@H](CO)[C@@H](O)[C@H](O)[C@H]2O)cc1 |r|
Show InChI InChI=1S/C21H25ClO5S/c1-2-27-15-6-3-12(4-7-15)9-14-10-13(5-8-16(14)22)21-20(26)19(25)18(24)17(11-23)28-21/h3-8,10,17-21,23-26H,2,9,11H2,1H3/t17-,18-,19+,20-,21+/m1/s1
n/an/a 1.21E+3n/an/an/an/an/an/a
Taisho Pharmaceutical Co., Ltd.
Curated by ChEMBL
Assay Description
Inhibition of human SGLT1 expressed in CHOK1 cells assessed as inhibition of glucose uptake
J Med Chem 53: 3247-61 (2010)
Article DOI: 10.1021/jm901893x
BindingDB Entry DOI: 10.7270/Q2KH0NG6
Sodium/glucose cotransporter 2
(Homo sapiens (Human))
BDBM50315436
((1S)-1,5-Anhydro-1-[4-chloro-3-(4-ethoxybenzyl)phe...)
Show SMILES CCOc1ccc(Cc2cc(ccc2Cl)[C@@H]2S[C@H](CO)[C@@H](O)[C@H](O)[C@H]2O)cc1 |r|
Show InChI InChI=1S/C21H25ClO5S/c1-2-27-15-6-3-12(4-7-15)9-14-10-13(5-8-16(14)22)21-20(26)19(25)18(24)17(11-23)28-21/h3-8,10,17-21,23-26H,2,9,11H2,1H3/t17-,18-,19+,20-,21+/m1/s1
n/an/a 1.80n/an/an/an/an/an/a
Taisho Pharmaceutical Co., Ltd.
Curated by ChEMBL
Assay Description
Inhibition of human SGLT2 expressed in CHOK1 cells assessed as inhibition of glucose uptake
J Med Chem 53: 3247-61 (2010)
Article DOI: 10.1021/jm901893x
BindingDB Entry DOI: 10.7270/Q2KH0NG6