BDBM50315501 CHEMBL1088846::N-(3-chlorophenylsulfonyl)-3-(1-(naphthalen-2-ylmethyl)-2-oxoindolin-7-yl)acrylamide
SMILES: Clc1cccc(c1)S(=O)(=O)NC(=O)\C=C\c1cccc2CC(=O)N(Cc3ccc4ccccc4c3)c12
InChI Key: InChIKey=VIFRNWNCPJALHQ-BUHFOSPRSA-N
Data: 2 IC50
Activity Spreadsheet -- Enzyme Inhibition Constant Data from BindingDB
Found 2 hits for monomerid = 50315501
Trg + Lig
Ki
nM
ΔG°
kcal/mole
IC50
nM
Kd
nM
EC50/IC50
nM
koff
s-1
kon
M-1s-1
pHTemp
°C
Prostaglandin E2 receptor
(Homo sapiens (Human))
BDBM50315501
(CHEMBL1088846 | N-(3-chlorophenylsulfonyl)-3-(1-(n...)
Show SMILES Clc1cccc(c1)S(=O)(=O)NC(=O)\C=C\c1cccc2CC(=O)N(Cc3ccc4ccccc4c3)c12
Show InChI InChI=1S/C28H21ClN2O4S/c29-24-9-4-10-25(17-24)36(34,35)30-26(32)14-13-21-7-3-8-23-16-27(33)31(28(21)23)18-19-11-12-20-5-1-2-6-22(20)15-19/h1-15,17H,16,18H2,(H,30,32)/b14-13+
n/an/a 8.10n/an/an/an/an/an/a
deCODE Chemistry
Curated by ChEMBL
Assay Description
Displacement of [3H]PGE2 from human EP3 receptor in presence of 10% human serum
Bioorg Med Chem Lett 20: 2658-64 (2010)
Article DOI: 10.1016/j.bmcl.2010.02.028
BindingDB Entry DOI: 10.7270/Q2668DCG
Prostaglandin E2 receptor
(Homo sapiens (Human))
BDBM50315501
(CHEMBL1088846 | N-(3-chlorophenylsulfonyl)-3-(1-(n...)
Show SMILES Clc1cccc(c1)S(=O)(=O)NC(=O)\C=C\c1cccc2CC(=O)N(Cc3ccc4ccccc4c3)c12
Show InChI InChI=1S/C28H21ClN2O4S/c29-24-9-4-10-25(17-24)36(34,35)30-26(32)14-13-21-7-3-8-23-16-27(33)31(28(21)23)18-19-11-12-20-5-1-2-6-22(20)15-19/h1-15,17H,16,18H2,(H,30,32)/b14-13+
n/an/a 0.600n/an/an/an/an/an/a
deCODE Chemistry
Curated by ChEMBL
Assay Description
Displacement of [3H]PGE2 from human EP3 receptor in buffer
Bioorg Med Chem Lett 20: 2658-64 (2010)
Article DOI: 10.1016/j.bmcl.2010.02.028
BindingDB Entry DOI: 10.7270/Q2668DCG