BDBM50315532 3-(1-(3,4-difluorobenzyl)-3-methyl-2-oxoindolin-7-yl)-N-(2,4,5-trifluorophenylsulfonyl)acrylamide::CHEMBL479868
SMILES: CC1C(=O)N(Cc2ccc(F)c(F)c2)c2c1cccc2\C=C\C(=O)NS(=O)(=O)c1cc(F)c(F)cc1F
InChI Key: InChIKey=NERHBFOFPYUZIX-SOFGYWHQSA-N
Data: 2 IC50
Activity Spreadsheet -- Enzyme Inhibition Constant Data from BindingDB
Found 2 hits for monomerid = 50315532
Trg + Lig
Ki
nM
ΔG°
kcal/mole
IC50
nM
Kd
nM
EC50/IC50
nM
koff
s-1
kon
M-1s-1
pHTemp
°C
Prostaglandin E2 receptor
(Homo sapiens (Human))
BDBM50315532
(3-(1-(3,4-difluorobenzyl)-3-methyl-2-oxoindolin-7-...)
Show SMILES CC1C(=O)N(Cc2ccc(F)c(F)c2)c2c1cccc2\C=C\C(=O)NS(=O)(=O)c1cc(F)c(F)cc1F
Show InChI InChI=1S/C25H17F5N2O4S/c1-13-16-4-2-3-15(24(16)32(25(13)34)12-14-5-7-17(26)18(27)9-14)6-8-23(33)31-37(35,36)22-11-20(29)19(28)10-21(22)30/h2-11,13H,12H2,1H3,(H,31,33)/b8-6+
n/an/a 1.40n/an/an/an/an/an/a
deCODE Chemistry
Curated by ChEMBL
Assay Description
Displacement of [3H]PGE2 from human EP3 receptor in buffer
Bioorg Med Chem Lett 20: 2658-64 (2010)
Article DOI: 10.1016/j.bmcl.2010.02.028
BindingDB Entry DOI: 10.7270/Q2668DCG
Prostaglandin E2 receptor
(Homo sapiens (Human))
BDBM50315532
(3-(1-(3,4-difluorobenzyl)-3-methyl-2-oxoindolin-7-...)
Show SMILES CC1C(=O)N(Cc2ccc(F)c(F)c2)c2c1cccc2\C=C\C(=O)NS(=O)(=O)c1cc(F)c(F)cc1F
Show InChI InChI=1S/C25H17F5N2O4S/c1-13-16-4-2-3-15(24(16)32(25(13)34)12-14-5-7-17(26)18(27)9-14)6-8-23(33)31-37(35,36)22-11-20(29)19(28)10-21(22)30/h2-11,13H,12H2,1H3,(H,31,33)/b8-6+
n/an/a 10.7n/an/an/an/an/an/a
deCODE Chemistry
Curated by ChEMBL
Assay Description
Displacement of [3H]PGE2 from human EP3 receptor in presence of 10% human serum
Bioorg Med Chem Lett 20: 2658-64 (2010)
Article DOI: 10.1016/j.bmcl.2010.02.028
BindingDB Entry DOI: 10.7270/Q2668DCG