BDBM50315615 7-(3-(trifluoromethyl)pyridin-2-yl)-N-(5-(trifluoromethyl)pyridin-2-yl)-1,8-naphthyridin-4-amine::7-[3-(Trifluoromethyl)pyridin-2-yl]-N-[5-(trifluoromethyl)-pyridin-2-yl]-1,8-naphthyridin-4-amine::CHEMBL1089119
SMILES: FC(F)(F)c1ccc(Nc2ccnc3nc(ccc23)-c2ncccc2C(F)(F)F)nc1
InChI Key: InChIKey=ZDSWMSRFTNIEJV-UHFFFAOYSA-N
Data: 5 IC50
Activity Spreadsheet -- Enzyme Inhibition Constant Data from BindingDB
Found 5 hits for monomerid = 50315615
Trg + Lig
Ki
nM
ΔG°
kcal/mole
IC50
nM
Kd
nM
EC50/IC50
nM
koff
s-1
kon
M-1s-1
pHTemp
°C
Transient receptor potential cation channel subfamily V member 1
(Homo sapiens (Human))
BDBM50315615
(7-(3-(trifluoromethyl)pyridin-2-yl)-N-(5-(trifluor...)
Show SMILES FC(F)(F)c1ccc(Nc2ccnc3nc(ccc23)-c2ncccc2C(F)(F)F)nc1
Show InChI InChI=1S/C20H11F6N5/c21-19(22,23)11-3-6-16(29-10-11)30-14-7-9-28-18-12(14)4-5-15(31-18)17-13(20(24,25)26)2-1-8-27-17/h1-10H,(H,28,29,30,31)
Reactome pathway
n/an/a 2.20n/an/an/an/an/an/a
Neurogen Corporation
Curated by ChEMBL
Assay Description
Antagonist activity at human TRPV1 assessed as inhibition of capsaicin-induced receptor activation by FLIPR assay
Bioorg Med Chem Lett 20: 4359-63 (2010)
Article DOI: 10.1016/j.bmcl.2010.06.069
BindingDB Entry DOI: 10.7270/Q2959HRM
Vanilloid receptor
(Rattus norvegicus (rat))
BDBM50315615
(7-(3-(trifluoromethyl)pyridin-2-yl)-N-(5-(trifluor...)
Show SMILES FC(F)(F)c1ccc(Nc2ccnc3nc(ccc23)-c2ncccc2C(F)(F)F)nc1
Show InChI InChI=1S/C20H11F6N5/c21-19(22,23)11-3-6-16(29-10-11)30-14-7-9-28-18-12(14)4-5-15(31-18)17-13(20(24,25)26)2-1-8-27-17/h1-10H,(H,28,29,30,31)
Reactome pathway
n/an/a 3.20n/an/an/an/an/an/a
Neurogen Corporation
Curated by ChEMBL
Assay Description
Antagonist activity at Sprague-Dawley rat dorsal root ganglion TRPV1 assessed as inhibition of pH (5.0 to 5.5)-induced receptor activation
Bioorg Med Chem Lett 20: 4359-63 (2010)
Article DOI: 10.1016/j.bmcl.2010.06.069
BindingDB Entry DOI: 10.7270/Q2959HRM
Mitogen-activated protein kinase 3
(Homo sapiens (Human))
BDBM50315615
(7-(3-(trifluoromethyl)pyridin-2-yl)-N-(5-(trifluor...)
Show SMILES FC(F)(F)c1ccc(Nc2ccnc3nc(ccc23)-c2ncccc2C(F)(F)F)nc1
Show InChI InChI=1S/C20H11F6N5/c21-19(22,23)11-3-6-16(29-10-11)30-14-7-9-28-18-12(14)4-5-15(31-18)17-13(20(24,25)26)2-1-8-27-17/h1-10H,(H,28,29,30,31)
Reactome pathway
n/an/a 980n/an/an/an/an/an/a
Neurogen Corporation
Curated by ChEMBL
Assay Description
Inhibition of human ERK1
J Med Chem 53: 3330-48 (2010)
Article DOI: 10.1021/jm100051g
BindingDB Entry DOI: 10.7270/Q2474BTP
Vanilloid receptor
(Rattus norvegicus (rat))
BDBM50315615
(7-(3-(trifluoromethyl)pyridin-2-yl)-N-(5-(trifluor...)
Show SMILES FC(F)(F)c1ccc(Nc2ccnc3nc(ccc23)-c2ncccc2C(F)(F)F)nc1
Show InChI InChI=1S/C20H11F6N5/c21-19(22,23)11-3-6-16(29-10-11)30-14-7-9-28-18-12(14)4-5-15(31-18)17-13(20(24,25)26)2-1-8-27-17/h1-10H,(H,28,29,30,31)
Reactome pathway
n/an/a 3.25n/an/an/an/a5.0n/a
Neurogen Corporation
Curated by ChEMBL
Assay Description
Inhibition of rat TRPV1 at pH 5 to 5.5
J Med Chem 53: 3330-48 (2010)
Article DOI: 10.1021/jm100051g
BindingDB Entry DOI: 10.7270/Q2474BTP
Transient receptor potential cation channel subfamily V member 1
(Homo sapiens (Human))
BDBM50315615
(7-(3-(trifluoromethyl)pyridin-2-yl)-N-(5-(trifluor...)
Show SMILES FC(F)(F)c1ccc(Nc2ccnc3nc(ccc23)-c2ncccc2C(F)(F)F)nc1
Show InChI InChI=1S/C20H11F6N5/c21-19(22,23)11-3-6-16(29-10-11)30-14-7-9-28-18-12(14)4-5-15(31-18)17-13(20(24,25)26)2-1-8-27-17/h1-10H,(H,28,29,30,31)
Reactome pathway
n/an/a 2.20n/an/an/an/an/an/a
Neurogen Corporation
Curated by ChEMBL
Assay Description
Antagonist activity at human recombinant TRPV1 expressed in HEK293 cells assessed as inhibition of capsazepine-induced calcium mobilization by FLIPR ...
J Med Chem 53: 3330-48 (2010)
Article DOI: 10.1021/jm100051g
BindingDB Entry DOI: 10.7270/Q2474BTP