BDBM50315799 3-(4-Pyrrolidin-2-ylphenyl)-1H-benzimidazole-4-carboxamide::CHEMBL1093845
SMILES: NC(=O)c1cccc2[nH]c(nc12)-c1ccc(cc1)C1CCNC1
InChI Key: InChIKey=AJHYSGSNCMPGLY-UHFFFAOYSA-N
Data: 1 KI  1 EC50
Activity Spreadsheet -- Enzyme Inhibition Constant Data from BindingDB
Found 2 hits for monomerid = 50315799
Trg + Lig
Ki
nM
ΔG°
kcal/mole
IC50
nM
Kd
nM
EC50/IC50
nM
koff
s-1
kon
M-1s-1
pHTemp
°C
Poly [ADP-ribose] polymerase 1
(Homo sapiens (Human))
BDBM50315799
(3-(4-Pyrrolidin-2-ylphenyl)-1H-benzimidazole-4-car...)
Show SMILES NC(=O)c1cccc2[nH]c(nc12)-c1ccc(cc1)C1CCNC1
Show InChI InChI=1S/C18H18N4O/c19-17(23)14-2-1-3-15-16(14)22-18(21-15)12-6-4-11(5-7-12)13-8-9-20-10-13/h1-7,13,20H,8-10H2,(H2,19,23)(H,21,22)
3n/an/an/an/an/an/an/an/a
Abbott Laboratories
Curated by ChEMBL
Assay Description
Inhibition of PARP1 using [3H]NAD+ by top count scintillation counting
J Med Chem 53: 3142-53 (2010)
Article DOI: 10.1021/jm901775y
BindingDB Entry DOI: 10.7270/Q2N879XR
Poly [ADP-ribose] polymerase 1
(Homo sapiens (Human))
BDBM50315799
(3-(4-Pyrrolidin-2-ylphenyl)-1H-benzimidazole-4-car...)
Show SMILES NC(=O)c1cccc2[nH]c(nc12)-c1ccc(cc1)C1CCNC1
Show InChI InChI=1S/C18H18N4O/c19-17(23)14-2-1-3-15-16(14)22-18(21-15)12-6-4-11(5-7-12)13-8-9-20-10-13/h1-7,13,20H,8-10H2,(H2,19,23)(H,21,22)
n/an/an/an/a 36n/an/an/an/a
Abbott Laboratories
Curated by ChEMBL
Assay Description
Inhibition of PARP1 in human C41 cells by FITC-conjugated DAPI staining
J Med Chem 53: 3142-53 (2010)
Article DOI: 10.1021/jm901775y
BindingDB Entry DOI: 10.7270/Q2N879XR