BDBM50315815 2-Amino-4-(4'-benzylthio-3-chlorobiphenyl-4-yl)-2-(phosphoryloxymethyl)butanol::CHEMBL1092285
SMILES: CP(O)(=O)OCC(N)(CO)CCc1ccc(cc1Cl)-c1ccc(SCc2ccccc2)cc1
InChI Key: InChIKey=HSKSTTRNPZEKNY-UHFFFAOYSA-N
Data: 2 EC50
Activity Spreadsheet -- Enzyme Inhibition Constant Data from BindingDB
Found 2 hits for monomerid = 50315815
Trg + Lig
Ki
nM
ΔG°
kcal/mole
IC50
nM
Kd
nM
EC50/IC50
nM
koff
s-1
kon
M-1s-1
pHTemp
°C
Sphingosine 1-phosphate receptor 3
(Homo sapiens (Human))
BDBM50315815
(2-Amino-4-(4'-benzylthio-3-chlorobiphenyl-4-yl)-2-...)
Show SMILES CP(O)(=O)OCC(N)(CO)CCc1ccc(cc1Cl)-c1ccc(SCc2ccccc2)cc1
Show InChI InChI=1S/C25H29ClNO4PS/c1-32(29,30)31-18-25(27,17-28)14-13-21-7-8-22(15-24(21)26)20-9-11-23(12-10-20)33-16-19-5-3-2-4-6-19/h2-12,15,28H,13-14,16-18,27H2,1H3,(H,29,30)
NCI pathway
Reactome pathway
n/an/an/an/a>1.00E+3n/an/an/an/a
Mitsubishi Tanabe Pharma Corporation
Curated by ChEMBL
Assay Description
Agonist activity at human S1P3 receptor expressed in CHO cells assessed as intracellular calcium mobilization
J Med Chem 53: 3154-68 (2010)
Article DOI: 10.1021/jm901776q
BindingDB Entry DOI: 10.7270/Q2HH6K7W
Sphingosine 1-phosphate receptor 1
(Homo sapiens (Human))
BDBM50315815
(2-Amino-4-(4'-benzylthio-3-chlorobiphenyl-4-yl)-2-...)
Show SMILES CP(O)(=O)OCC(N)(CO)CCc1ccc(cc1Cl)-c1ccc(SCc2ccccc2)cc1
Show InChI InChI=1S/C25H29ClNO4PS/c1-32(29,30)31-18-25(27,17-28)14-13-21-7-8-22(15-24(21)26)20-9-11-23(12-10-20)33-16-19-5-3-2-4-6-19/h2-12,15,28H,13-14,16-18,27H2,1H3,(H,29,30)
Reactome pathway
n/an/an/an/a 2.10n/an/an/an/a
Mitsubishi Tanabe Pharma Corporation
Curated by ChEMBL
Assay Description
Agonist activity at human S1P1 receptor expressed in human Chem1 cells assessed as intracellular calcium mobilization
J Med Chem 53: 3154-68 (2010)
Article DOI: 10.1021/jm901776q
BindingDB Entry DOI: 10.7270/Q2HH6K7W