BDBM50315850 CHEMBL1091643::N-(6-methyl-3-styryl-1H-indazol-5-yl)-2-phenylacetamide
SMILES: Cc1cc2[nH]nc(\C=C\c3ccccc3)c2cc1NC(=O)Cc1ccccc1
InChI Key: InChIKey=VYAAXBSGJBZIIN-OUKQBFOZSA-N
Data: 1 IC50
Activity Spreadsheet -- Enzyme Inhibition Constant Data from BindingDB
Found 1 hit for monomerid = 50315850
Trg + Lig
Ki
nM
ΔG°
kcal/mole
IC50
nM
Kd
nM
EC50/IC50
nM
koff
s-1
kon
M-1s-1
pHTemp
°C
Aurora kinase A
(Homo sapiens (Human))
BDBM50315850
(CHEMBL1091643 | N-(6-methyl-3-styryl-1H-indazol-5-...)
Show SMILES Cc1cc2[nH]nc(\C=C\c3ccccc3)c2cc1NC(=O)Cc1ccccc1
Show InChI InChI=1S/C24H21N3O/c1-17-14-23-20(21(26-27-23)13-12-18-8-4-2-5-9-18)16-22(17)25-24(28)15-19-10-6-3-7-11-19/h2-14,16H,15H2,1H3,(H,25,28)(H,26,27)/b13-12+
NCI pathway
Reactome pathway
n/an/a 19n/an/an/an/an/an/a
S*BIO Pte. Ltd
Curated by ChEMBL
Assay Description
Inhibition of hexahistidine tagged recombinant Aurora A expressed in Hi-5 cells assessed as ATP remaining after 2 hrs by bioluminnescence
Bioorg Med Chem Lett 20: 2443-7 (2010)
Article DOI: 10.1016/j.bmcl.2010.03.018
BindingDB Entry DOI: 10.7270/Q24B31HK