BDBM50315897 2,6-difluoro-N-(3-(5-(2-(1,2,3,4-tetrahydroisoquinolin-6-ylamino)pyrimidin-4-yl)imidazo[2,1-b]thiazol-6-yl)phenyl)benzamide::CHEMBL1090359
SMILES: Fc1cccc(F)c1C(=O)Nc1cccc(c1)-c1nc2sccn2c1-c1ccnc(Nc2ccc3CNCCc3c2)n1
InChI Key: InChIKey=UUFDRURWKKKAJF-UHFFFAOYSA-N
Data: 2 IC50
Activity Spreadsheet -- Enzyme Inhibition Constant Data from BindingDB
Found 2 hits for monomerid = 50315897
Trg + Lig
Ki
nM
ΔG°
kcal/mole
IC50
nM
Kd
nM
EC50/IC50
nM
koff
s-1
kon
M-1s-1
pHTemp
°C
Receptor tyrosine-protein kinase erbB-2
(Homo sapiens (Human))
BDBM50315897
(2,6-difluoro-N-(3-(5-(2-(1,2,3,4-tetrahydroisoquin...)
Show SMILES Fc1cccc(F)c1C(=O)Nc1cccc(c1)-c1nc2sccn2c1-c1ccnc(Nc2ccc3CNCCc3c2)n1
Show InChI InChI=1S/C31H23F2N7OS/c32-23-5-2-6-24(33)26(23)29(41)36-21-4-1-3-19(16-21)27-28(40-13-14-42-31(40)39-27)25-10-12-35-30(38-25)37-22-8-7-20-17-34-11-9-18(20)15-22/h1-8,10,12-16,34H,9,11,17H2,(H,36,41)(H,35,37,38)
n/an/a 7.20n/an/an/an/an/an/a
Abbott Laboratories
Curated by ChEMBL
Assay Description
Inhibition of ErbB2 by time resolved fluorescence assay
Bioorg Med Chem Lett 20: 2452-5 (2010)
Article DOI: 10.1016/j.bmcl.2010.03.015
BindingDB Entry DOI: 10.7270/Q2M908VT
Insulin-like growth factor I receptor
(Homo sapiens (Human))
BDBM50315897
(2,6-difluoro-N-(3-(5-(2-(1,2,3,4-tetrahydroisoquin...)
Show SMILES Fc1cccc(F)c1C(=O)Nc1cccc(c1)-c1nc2sccn2c1-c1ccnc(Nc2ccc3CNCCc3c2)n1
Show InChI InChI=1S/C31H23F2N7OS/c32-23-5-2-6-24(33)26(23)29(41)36-21-4-1-3-19(16-21)27-28(40-13-14-42-31(40)39-27)25-10-12-35-30(38-25)37-22-8-7-20-17-34-11-9-18(20)15-22/h1-8,10,12-16,34H,9,11,17H2,(H,36,41)(H,35,37,38)
Reactome pathway
n/an/a 100n/an/an/an/an/an/a
Abbott Laboratories
Curated by ChEMBL
Assay Description
Inhibition of human recombinant IGF1R expressed in Sf21 cells by time resolved fluorescence assay
Bioorg Med Chem Lett 20: 2452-5 (2010)
Article DOI: 10.1016/j.bmcl.2010.03.015
BindingDB Entry DOI: 10.7270/Q2M908VT