BDBM50316198 4-(2-(4-amino-1,2,5-oxadiazol-3-yl)-1-ethyl-6-(2-(methylamino)ethoxy)-1H-imidazo[4,5-c]pyridin-4-yl)-2-methylbut-3-yn-2-ol::CHEMBL1098943
SMILES: CCn1c(nc2c(nc(OCCNC)cc12)C#CC(C)(C)O)-c1nonc1N
InChI Key: InChIKey=RYFDZZFKNCPTJF-UHFFFAOYSA-N
Data: 3 IC50
Activity Spreadsheet -- Enzyme Inhibition Constant Data from BindingDB
Found 3 hits for monomerid = 50316198
Trg + Lig
Ki
nM
ΔG°
kcal/mole
IC50
nM
Kd
nM
EC50/IC50
nM
koff
s-1
kon
M-1s-1
pHTemp
°C
Glycogen synthase kinase-3 beta
(Homo sapiens (Human))
BDBM50316198
(4-(2-(4-amino-1,2,5-oxadiazol-3-yl)-1-ethyl-6-(2-(...)
Show SMILES CCn1c(nc2c(nc(OCCNC)cc12)C#CC(C)(C)O)-c1nonc1N
Show InChI InChI=1S/C18H23N7O3/c1-5-25-12-10-13(27-9-8-20-4)21-11(6-7-18(2,3)26)14(12)22-17(25)15-16(19)24-28-23-15/h10,20,26H,5,8-9H2,1-4H3,(H2,19,24)
NCI pathway
Reactome pathway
n/an/a 2.60E+3n/an/an/an/an/an/a
GlaxoSmithKline
Curated by ChEMBL
Assay Description
Inhibition of GSK3beta phosphorylation in human BT474 cells
Bioorg Med Chem Lett 19: 1508-11 (2009)
Article DOI: 10.1016/j.bmcl.2009.01.002
BindingDB Entry DOI: 10.7270/Q2XK8FP7
Serine/threonine-protein kinase AKT2
(Homo sapiens (Human))
BDBM50316198
(4-(2-(4-amino-1,2,5-oxadiazol-3-yl)-1-ethyl-6-(2-(...)
Show SMILES CCn1c(nc2c(nc(OCCNC)cc12)C#CC(C)(C)O)-c1nonc1N
Show InChI InChI=1S/C18H23N7O3/c1-5-25-12-10-13(27-9-8-20-4)21-11(6-7-18(2,3)26)14(12)22-17(25)15-16(19)24-28-23-15/h10,20,26H,5,8-9H2,1-4H3,(H2,19,24)
n/an/a 79n/an/an/an/an/an/a
GlaxoSmithKline
Curated by ChEMBL
Assay Description
Inhibition of AKT2
Bioorg Med Chem Lett 19: 1508-11 (2009)
Article DOI: 10.1016/j.bmcl.2009.01.002
BindingDB Entry DOI: 10.7270/Q2XK8FP7
RAC-alpha serine/threonine-protein kinase
(Homo sapiens (Human))
BDBM50316198
(4-(2-(4-amino-1,2,5-oxadiazol-3-yl)-1-ethyl-6-(2-(...)
Show SMILES CCn1c(nc2c(nc(OCCNC)cc12)C#CC(C)(C)O)-c1nonc1N
Show InChI InChI=1S/C18H23N7O3/c1-5-25-12-10-13(27-9-8-20-4)21-11(6-7-18(2,3)26)14(12)22-17(25)15-16(19)24-28-23-15/h10,20,26H,5,8-9H2,1-4H3,(H2,19,24)
n/an/a 12n/an/an/an/an/an/a
GlaxoSmithKline
Curated by ChEMBL
Assay Description
Inhibition of AKT
Bioorg Med Chem Lett 19: 1508-11 (2009)
Article DOI: 10.1016/j.bmcl.2009.01.002
BindingDB Entry DOI: 10.7270/Q2XK8FP7