BDBM50316209 CHEMBL1096893::N-(2-(3-benzylureido)ethyl)-6-(2,2-diphenylethylamino)-9-((2R,3R,4S,5S)-5-(ethylcarbamoyl)-3,4-dihydroxytetrahydrofuran-2-yl)-9H-purine-2-carboxamide
SMILES: CCNC(=O)[C@H]1O[C@H]([C@H](O)[C@@H]1O)n1cnc2c(NCC(c3ccccc3)c3ccccc3)nc(nc12)C(=O)NCCNC(=O)NCc1ccccc1
InChI Key: InChIKey=ITUVFXOQISGYOY-BBJOTMRQSA-N
Data: 1 IC50
Activity Spreadsheet -- Enzyme Inhibition Constant Data from BindingDB
Found 1 hit for monomerid = 50316209
Trg + Lig
Ki
nM
ΔG°
kcal/mole
IC50
nM
Kd
nM
EC50/IC50
nM
koff
s-1
kon
M-1s-1
pHTemp
°C
Adenosine receptor A2a
(Homo sapiens (Human))
BDBM50316209
(CHEMBL1096893 | N-(2-(3-benzylureido)ethyl)-6-(2,2...)
Show SMILES CCNC(=O)[C@H]1O[C@H]([C@H](O)[C@@H]1O)n1cnc2c(NCC(c3ccccc3)c3ccccc3)nc(nc12)C(=O)NCCNC(=O)NCc1ccccc1 |r|
Show InChI InChI=1S/C37H41N9O6/c1-2-38-34(49)30-28(47)29(48)36(52-30)46-22-43-27-31(41-21-26(24-14-8-4-9-15-24)25-16-10-5-11-17-25)44-32(45-33(27)46)35(50)39-18-19-40-37(51)42-20-23-12-6-3-7-13-23/h3-17,22,26,28-30,36,47-48H,2,18-21H2,1H3,(H,38,49)(H,39,50)(H2,40,42,51)(H,41,44,45)/t28-,29+,30-,36+/m0/s1
NCI pathway
Reactome pathway
n/an/a 6n/an/an/an/an/an/a
Pfizer Global Research and Development
Curated by ChEMBL
Assay Description
Agonist activity at adenosine A2A receptor in fMLP-stimulated human neutrophils assessed as inhibition of superoxide production by colorimetric analy...
Bioorg Med Chem Lett 19: 4471-5 (2009)
Article DOI: 10.1016/j.bmcl.2009.05.027
BindingDB Entry DOI: 10.7270/Q2ST7Q0C