BDBM50316238 2-{4-[(Ethylamino)methyl]phenyl}-2H-indazole-7-carboxamide::CHEMBL1094969
SMILES: CCNCc1ccc(cc1)-n1cc2cccc(C(N)=O)c2n1
InChI Key: InChIKey=LFRJYXYHAKNOIJ-UHFFFAOYSA-N
Data: 1 IC50
Activity Spreadsheet -- Enzyme Inhibition Constant Data from BindingDB
Found 1 hit for monomerid = 50316238
Trg + Lig
Ki
nM
ΔG°
kcal/mole
IC50
nM
Kd
nM
EC50/IC50
nM
koff
s-1
kon
M-1s-1
pHTemp
°C
Poly [ADP-ribose] polymerase 1
(Homo sapiens (Human))
BDBM50316238
(2-{4-[(Ethylamino)methyl]phenyl}-2H-indazole-7-car...)
Show SMILES CCNCc1ccc(cc1)-n1cc2cccc(C(N)=O)c2n1
Show InChI InChI=1S/C17H18N4O/c1-2-19-10-12-6-8-14(9-7-12)21-11-13-4-3-5-15(17(18)22)16(13)20-21/h3-9,11,19H,2,10H2,1H3,(H2,18,22)
n/an/a 4.30n/an/an/an/an/an/a
IRBM/Merck Research Labs Rome
Curated by ChEMBL
Assay Description
Inhibition of human PARP1 by SPA
J Med Chem 52: 7170-85 (2009)
Article DOI: 10.1021/jm901188v
BindingDB Entry DOI: 10.7270/Q2DN457M