BDBM50316483 4-[1-Ethyl-3-(4-{[(phenylamino)carbonyl]amino}phenyl)-1Hpyrazol-4-yl]-N-[2-(4-methyl-1-piperazinyl)ethyl]-1H-pyrrolo-[2,3-b]pyridine-2-carboxamide::CHEMBL1094706
SMILES: CCn1cc(c(n1)-c1ccc(NC(=O)Nc2ccccc2)cc1)-c1ccnc2[nH]c(cc12)C(=O)NCCN1CCN(C)CC1
InChI Key: InChIKey=PCWVNRZWJPOOHP-UHFFFAOYSA-N
Data: 2 IC50
Activity Spreadsheet -- Enzyme Inhibition Constant Data from BindingDB
Found 2 hits for monomerid = 50316483
Trg + Lig
Ki
nM
ΔG°
kcal/mole
IC50
nM
Kd
nM
EC50/IC50
nM
koff
s-1
kon
M-1s-1
pHTemp
°C
Aurora kinase A
(Homo sapiens (Human))
BDBM50316483
(4-[1-Ethyl-3-(4-{[(phenylamino)carbonyl]amino}phen...)
Show SMILES CCn1cc(c(n1)-c1ccc(NC(=O)Nc2ccccc2)cc1)-c1ccnc2[nH]c(cc12)C(=O)NCCN1CCN(C)CC1
Show InChI InChI=1S/C33H37N9O2/c1-3-42-22-28(30(39-42)23-9-11-25(12-10-23)37-33(44)36-24-7-5-4-6-8-24)26-13-14-34-31-27(26)21-29(38-31)32(43)35-15-16-41-19-17-40(2)18-20-41/h4-14,21-22H,3,15-20H2,1-2H3,(H,34,38)(H,35,43)(H2,36,37,44)
NCI pathway
Reactome pathway
n/an/a 203n/an/an/an/an/an/a
GlaxoSmithKline
Curated by ChEMBL
Assay Description
Inhibition of human Aurora A
J Med Chem 53: 3973-4001 (2010)
Article DOI: 10.1021/jm901870q
BindingDB Entry DOI: 10.7270/Q27082CK
Aurora kinase B
(Homo sapiens (Human))
BDBM50316483
(4-[1-Ethyl-3-(4-{[(phenylamino)carbonyl]amino}phen...)
Show SMILES CCn1cc(c(n1)-c1ccc(NC(=O)Nc2ccccc2)cc1)-c1ccnc2[nH]c(cc12)C(=O)NCCN1CCN(C)CC1
Show InChI InChI=1S/C33H37N9O2/c1-3-42-22-28(30(39-42)23-9-11-25(12-10-23)37-33(44)36-24-7-5-4-6-8-24)26-13-14-34-31-27(26)21-29(38-31)32(43)35-15-16-41-19-17-40(2)18-20-41/h4-14,21-22H,3,15-20H2,1-2H3,(H,34,38)(H,35,43)(H2,36,37,44)
Reactome pathway
n/an/a 5n/an/an/an/an/an/a
GlaxoSmithKline
Curated by ChEMBL
Assay Description
Inhibition of human Aurora B by rapid dilution method
J Med Chem 53: 3973-4001 (2010)
Article DOI: 10.1021/jm901870q
BindingDB Entry DOI: 10.7270/Q27082CK