BDBM50316484 CHEMBL1097839::N-[4-(4-{2-[(Dimethylamino)methyl]-1H-pyrrolo[2,3-b]pyridin-4-yl}-1-ethyl-1H-pyrazol-3-yl)phenyl]-N'-phenylurea
SMILES: CCn1cc(c(n1)-c1ccc(NC(=O)Nc2ccccc2)cc1)-c1ccnc2[nH]c(CN(C)C)cc12
InChI Key: InChIKey=BTQCPHBDUJMLMF-UHFFFAOYSA-N
Data: 2 IC50
Activity Spreadsheet -- Enzyme Inhibition Constant Data from BindingDB
Found 2 hits for monomerid = 50316484
Trg + Lig
Ki
nM
ΔG°
kcal/mole
IC50
nM
Kd
nM
EC50/IC50
nM
koff
s-1
kon
M-1s-1
pHTemp
°C
Aurora kinase A
(Homo sapiens (Human))
BDBM50316484
(CHEMBL1097839 | N-[4-(4-{2-[(Dimethylamino)methyl]...)
Show SMILES CCn1cc(c(n1)-c1ccc(NC(=O)Nc2ccccc2)cc1)-c1ccnc2[nH]c(CN(C)C)cc12
Show InChI InChI=1S/C28H29N7O/c1-4-35-18-25(23-14-15-29-27-24(23)16-22(30-27)17-34(2)3)26(33-35)19-10-12-21(13-11-19)32-28(36)31-20-8-6-5-7-9-20/h5-16,18H,4,17H2,1-3H3,(H,29,30)(H2,31,32,36)
NCI pathway
Reactome pathway
n/an/a 1.70E+3n/an/an/an/an/an/a
GlaxoSmithKline
Curated by ChEMBL
Assay Description
Inhibition of human Aurora A
J Med Chem 53: 3973-4001 (2010)
Article DOI: 10.1021/jm901870q
BindingDB Entry DOI: 10.7270/Q27082CK
Aurora kinase B
(Homo sapiens (Human))
BDBM50316484
(CHEMBL1097839 | N-[4-(4-{2-[(Dimethylamino)methyl]...)
Show SMILES CCn1cc(c(n1)-c1ccc(NC(=O)Nc2ccccc2)cc1)-c1ccnc2[nH]c(CN(C)C)cc12
Show InChI InChI=1S/C28H29N7O/c1-4-35-18-25(23-14-15-29-27-24(23)16-22(30-27)17-34(2)3)26(33-35)19-10-12-21(13-11-19)32-28(36)31-20-8-6-5-7-9-20/h5-16,18H,4,17H2,1-3H3,(H,29,30)(H2,31,32,36)
Reactome pathway
n/an/a 58n/an/an/an/an/an/a
GlaxoSmithKline
Curated by ChEMBL
Assay Description
Inhibition of human Aurora B by rapid dilution method
J Med Chem 53: 3973-4001 (2010)
Article DOI: 10.1021/jm901870q
BindingDB Entry DOI: 10.7270/Q27082CK