BDBM50316529 CHEMBL1095151::N-[(4R)-6-(4-Chlorophenyl)-7-(2,4-dichlorophenyl)-2,2-dimethyl-3,4-dihydro-2H-pyrano[2,3-b]pyridine-4-yl]-3,5-dimethyl-1H-pyrazole-4-carboxamide
SMILES: Cc1n[nH]c(C)c1C(=O)N[C@@H]1CC(C)(C)Oc2nc(-c3ccc(Cl)cc3Cl)c(cc12)-c1ccc(Cl)cc1
InChI Key: InChIKey=ASISOGRWKOFTRC-HSZRJFAPSA-N
Data: 3 IC50
Activity Spreadsheet -- Enzyme Inhibition Constant Data from BindingDB
Found 3 hits for monomerid = 50316529
Trg + Lig
Ki
nM
ΔG°
kcal/mole
IC50
nM
Kd
nM
EC50/IC50
nM
koff
s-1
kon
M-1s-1
pHTemp
°C
Cannabinoid receptor 1
(Homo sapiens (Human))
BDBM50316529
(CHEMBL1095151 | N-[(4R)-6-(4-Chlorophenyl)-7-(2,4-...)
Show SMILES Cc1n[nH]c(C)c1C(=O)N[C@@H]1CC(C)(C)Oc2nc(-c3ccc(Cl)cc3Cl)c(cc12)-c1ccc(Cl)cc1 |r|
Show InChI InChI=1S/C28H25Cl3N4O2/c1-14-24(15(2)35-34-14)26(36)32-23-13-28(3,4)37-27-21(23)12-20(16-5-7-17(29)8-6-16)25(33-27)19-10-9-18(30)11-22(19)31/h5-12,23H,13H2,1-4H3,(H,32,36)(H,34,35)/t23-/m1/s1
NCI pathway
Reactome pathway
n/an/a 0.200n/an/an/an/an/an/a
Merck Research Laboratories
Curated by ChEMBL
Assay Description
Displacement of [3H]CP55940 from human recombinant cannabinoid CB1 receptor expressed in CHO cells
J Med Chem 53: 4028-37 (2010)
Article DOI: 10.1021/jm100023j
BindingDB Entry DOI: 10.7270/Q2TQ61QD
Potassium voltage-gated channel subfamily H member 2
(Homo sapiens (Human))
BDBM50316529
(CHEMBL1095151 | N-[(4R)-6-(4-Chlorophenyl)-7-(2,4-...)
Show SMILES Cc1n[nH]c(C)c1C(=O)N[C@@H]1CC(C)(C)Oc2nc(-c3ccc(Cl)cc3Cl)c(cc12)-c1ccc(Cl)cc1 |r|
Show InChI InChI=1S/C28H25Cl3N4O2/c1-14-24(15(2)35-34-14)26(36)32-23-13-28(3,4)37-27-21(23)12-20(16-5-7-17(29)8-6-16)25(33-27)19-10-9-18(30)11-22(19)31/h5-12,23H,13H2,1-4H3,(H,32,36)(H,34,35)/t23-/m1/s1
Reactome pathway
n/an/a 1.60E+3n/an/an/an/an/an/a
Merck Research Laboratories
Curated by ChEMBL
Assay Description
Displacement of [35S]MK499 from human ERG expressed in HEK293 cells
J Med Chem 53: 4028-37 (2010)
Article DOI: 10.1021/jm100023j
BindingDB Entry DOI: 10.7270/Q2TQ61QD
Cannabinoid receptor 2
(Homo sapiens (Human))
BDBM50316529
(CHEMBL1095151 | N-[(4R)-6-(4-Chlorophenyl)-7-(2,4-...)
Show SMILES Cc1n[nH]c(C)c1C(=O)N[C@@H]1CC(C)(C)Oc2nc(-c3ccc(Cl)cc3Cl)c(cc12)-c1ccc(Cl)cc1 |r|
Show InChI InChI=1S/C28H25Cl3N4O2/c1-14-24(15(2)35-34-14)26(36)32-23-13-28(3,4)37-27-21(23)12-20(16-5-7-17(29)8-6-16)25(33-27)19-10-9-18(30)11-22(19)31/h5-12,23H,13H2,1-4H3,(H,32,36)(H,34,35)/t23-/m1/s1
Reactome pathway
n/an/a 2.30E+3n/an/an/an/an/an/a
Merck Research Laboratories
Curated by ChEMBL
Assay Description
Displacement of [3H]CP55940 from human recombinant cannabinoid CB2 receptor expressed in CHO cells
J Med Chem 53: 4028-37 (2010)
Article DOI: 10.1021/jm100023j
BindingDB Entry DOI: 10.7270/Q2TQ61QD