BDBM50316530 CHEMBL1098876::N-[(4R)-6-(4-Chlorophenyl)-7-(2,4-dichlorophenyl)-2,2-dimethyl-3,4-dihydro-2H-pyrano[2,3-b]pyridine-4-yl]-5-methyl-1H-1,2,4-triazole-3-carboxamide
SMILES: Cc1nnc([nH]1)C(=O)N[C@@H]1CC(C)(C)Oc2nc(-c3ccc(Cl)cc3Cl)c(cc12)-c1ccc(Cl)cc1
InChI Key: InChIKey=YDDAIFXAUXVOFU-OAQYLSRUSA-N
Data: 3 IC50
Activity Spreadsheet -- Enzyme Inhibition Constant Data from BindingDB
Found 3 hits for monomerid = 50316530
Trg + Lig
Ki
nM
ΔG°
kcal/mole
IC50
nM
Kd
nM
EC50/IC50
nM
koff
s-1
kon
M-1s-1
pHTemp
°C
Cannabinoid receptor 1
(Homo sapiens (Human))
BDBM50316530
(CHEMBL1098876 | N-[(4R)-6-(4-Chlorophenyl)-7-(2,4-...)
Show SMILES Cc1nnc([nH]1)C(=O)N[C@@H]1CC(C)(C)Oc2nc(-c3ccc(Cl)cc3Cl)c(cc12)-c1ccc(Cl)cc1 |r|
Show InChI InChI=1S/C26H22Cl3N5O2/c1-13-30-23(34-33-13)24(35)31-21-12-26(2,3)36-25-19(21)11-18(14-4-6-15(27)7-5-14)22(32-25)17-9-8-16(28)10-20(17)29/h4-11,21H,12H2,1-3H3,(H,31,35)(H,30,33,34)/t21-/m1/s1
NCI pathway
Reactome pathway
n/an/a 2n/an/an/an/an/an/a
Merck Research Laboratories
Curated by ChEMBL
Assay Description
Displacement of [3H]CP55940 from human recombinant cannabinoid CB1 receptor expressed in CHO cells
J Med Chem 53: 4028-37 (2010)
Article DOI: 10.1021/jm100023j
BindingDB Entry DOI: 10.7270/Q2TQ61QD
Potassium voltage-gated channel subfamily H member 2
(Homo sapiens (Human))
BDBM50316530
(CHEMBL1098876 | N-[(4R)-6-(4-Chlorophenyl)-7-(2,4-...)
Show SMILES Cc1nnc([nH]1)C(=O)N[C@@H]1CC(C)(C)Oc2nc(-c3ccc(Cl)cc3Cl)c(cc12)-c1ccc(Cl)cc1 |r|
Show InChI InChI=1S/C26H22Cl3N5O2/c1-13-30-23(34-33-13)24(35)31-21-12-26(2,3)36-25-19(21)11-18(14-4-6-15(27)7-5-14)22(32-25)17-9-8-16(28)10-20(17)29/h4-11,21H,12H2,1-3H3,(H,31,35)(H,30,33,34)/t21-/m1/s1
Reactome pathway
n/an/a 2.00E+3n/an/an/an/an/an/a
Merck Research Laboratories
Curated by ChEMBL
Assay Description
Displacement of [35S]MK499 from human ERG expressed in HEK293 cells
J Med Chem 53: 4028-37 (2010)
Article DOI: 10.1021/jm100023j
BindingDB Entry DOI: 10.7270/Q2TQ61QD
Cannabinoid receptor 2
(Homo sapiens (Human))
BDBM50316530
(CHEMBL1098876 | N-[(4R)-6-(4-Chlorophenyl)-7-(2,4-...)
Show SMILES Cc1nnc([nH]1)C(=O)N[C@@H]1CC(C)(C)Oc2nc(-c3ccc(Cl)cc3Cl)c(cc12)-c1ccc(Cl)cc1 |r|
Show InChI InChI=1S/C26H22Cl3N5O2/c1-13-30-23(34-33-13)24(35)31-21-12-26(2,3)36-25-19(21)11-18(14-4-6-15(27)7-5-14)22(32-25)17-9-8-16(28)10-20(17)29/h4-11,21H,12H2,1-3H3,(H,31,35)(H,30,33,34)/t21-/m1/s1
Reactome pathway
n/an/a 5.20E+3n/an/an/an/an/an/a
Merck Research Laboratories
Curated by ChEMBL
Assay Description
Displacement of [3H]CP55940 from human recombinant cannabinoid CB2 receptor expressed in CHO cells
J Med Chem 53: 4028-37 (2010)
Article DOI: 10.1021/jm100023j
BindingDB Entry DOI: 10.7270/Q2TQ61QD