null
SMILES: COC1=CC[C@]23CCN(C)[C@@]22C[C@H](O[C@@]12O)c1ccc(OC)c(O)c31
InChI Key: InChIKey=MLEYOIRGICHLGN-PZGXJPJSSA-N
Activity Spreadsheet -- Enzyme Inhibition Constant Data from BindingDB
Found 1 hit for monomerid = 50316552
Trg + Lig
Ki
nM
ΔG°
kcal/mole
IC50
nM
Kd
nM
EC50/IC50
nM
koff
s-1
kon
M-1s-1
pHTemp
°C
Delta-type opioid receptor
(Homo sapiens (Human))
BDBM50316552
(CHEMBL1096482 | prostephabyssine)
Show SMILES COC1=CC[C@]23CCN(C)[C@@]22C[C@H](O[C@@]12O)c1ccc(OC)c(O)c31 |r,t:2|
Show InChI InChI=1S/C19H23NO5/c1-20-9-8-17-7-6-14(24-3)19(22)18(17,20)10-13(25-19)11-4-5-12(23-2)16(21)15(11)17/h4-6,13,21-22H,7-10H2,1-3H3/t13-,17+,18-,19-/m0/s1
Reactome pathway
n/an/a 5.50E+3n/an/an/an/an/an/a
Griffith University
Curated by ChEMBL
Assay Description
Displacement of [3H]deltorphin-2 from human delta opioid receptor expressed in HEK293 cell membrane
J Nat Prod 73: 988-91 (2010)
Article DOI: 10.1021/np100009j
BindingDB Entry DOI: 10.7270/Q2FF3SHH