null
SMILES: OC(c1ccc(Cl)c(Cl)c1)(c1ccc2n(ncc2c1)-c1ccc(F)cc1)C(F)(F)F
InChI Key: InChIKey=ZLBLNXIABXEQQL-UHFFFAOYSA-N
Activity Spreadsheet -- Enzyme Inhibition Constant Data from BindingDB
Found 1 hit for monomerid = 50316557
Trg + Lig
Ki
nM
ΔG°
kcal/mole
IC50
nM
Kd
nM
EC50/IC50
nM
koff
s-1
kon
M-1s-1
pHTemp
°C
Glucocorticoid receptor
(Homo sapiens (Human))
BDBM50316557
(1-(3,4-dichlorophenyl)-2,2,2-trifluoro-1-(1-(4-flu...)
Show SMILES OC(c1ccc(Cl)c(Cl)c1)(c1ccc2n(ncc2c1)-c1ccc(F)cc1)C(F)(F)F
Show InChI InChI=1S/C21H12Cl2F4N2O/c22-17-7-1-14(10-18(17)23)20(30,21(25,26)27)13-2-8-19-12(9-13)11-28-29(19)16-5-3-15(24)4-6-16/h1-11,30H
n/an/a 178n/an/an/an/an/an/a
AMRI
Curated by ChEMBL
Assay Description
Binding affinity to human glucocorticoid receptor by fluorescence polariztion competitive binding assay
Bioorg Med Chem Lett 20: 3017-20 (2010)
Article DOI: 10.1016/j.bmcl.2010.04.012
BindingDB Entry DOI: 10.7270/Q23779P9