BDBM50316682 6-Bromo-8-{4-[4-(6-methoxyquinolin-8-yl)piperazin-1-yl]piperidin-1-yl}Quinoline::CHEMBL1096529
SMILES: COc1cc(N2CCN(CC2)C2CCN(CC2)c2cc(Br)cc3cccnc23)c2ncccc2c1
InChI Key: InChIKey=POCSVEHDZIFYRI-UHFFFAOYSA-N
Data: 1 KI  1 IC50
Activity Spreadsheet -- Enzyme Inhibition Constant Data from BindingDB
Found 2 hits for monomerid = 50316682
Trg + Lig
Ki
nM
ΔG°
kcal/mole
IC50
nM
Kd
nM
EC50/IC50
nM
koff
s-1
kon
M-1s-1
pHTemp
°C
5-hydroxytryptamine receptor 1A
(Homo sapiens (Human))
BDBM50316682
(6-Bromo-8-{4-[4-(6-methoxyquinolin-8-yl)piperazin-...)
Show SMILES COc1cc(N2CCN(CC2)C2CCN(CC2)c2cc(Br)cc3cccnc23)c2ncccc2c1
Show InChI InChI=1S/C28H30BrN5O/c1-35-24-17-21-5-3-9-31-28(21)26(19-24)34-14-12-32(13-15-34)23-6-10-33(11-7-23)25-18-22(29)16-20-4-2-8-30-27(20)25/h2-5,8-9,16-19,23H,6-7,10-15H2,1H3
0.610n/an/an/an/an/an/an/an/a
Pfizer Global Research and Development
Curated by ChEMBL
Assay Description
Displacement of [3H]8-OH-DPAT from human 5HT1A receptor expressed in CHO cells
J Med Chem 53: 4066-84 (2010)
Article DOI: 10.1021/jm1000908
BindingDB Entry DOI: 10.7270/Q28P60P7
5-hydroxytryptamine receptor 1A
(Homo sapiens (Human))
BDBM50316682
(6-Bromo-8-{4-[4-(6-methoxyquinolin-8-yl)piperazin-...)
Show SMILES COc1cc(N2CCN(CC2)C2CCN(CC2)c2cc(Br)cc3cccnc23)c2ncccc2c1
Show InChI InChI=1S/C28H30BrN5O/c1-35-24-17-21-5-3-9-31-28(21)26(19-24)34-14-12-32(13-15-34)23-6-10-33(11-7-23)25-18-22(29)16-20-4-2-8-30-27(20)25/h2-5,8-9,16-19,23H,6-7,10-15H2,1H3
n/an/a 10n/an/an/an/an/an/a
Pfizer Global Research and Development
Curated by ChEMBL
Assay Description
Antagonist activity at human 5HT1A receptor expressed in CHO cells assessed as blockade of 8-OH-DPAT-induced inhibition of forskolin-stimulated incre...
J Med Chem 53: 4066-84 (2010)
Article DOI: 10.1021/jm1000908
BindingDB Entry DOI: 10.7270/Q28P60P7