BDBM50316712 (Z,Z)-5-(4-Hydroxymethyl-benzylidene)-2-isopropylimino-3-phenyl-thiazolidin-4-one::CHEMBL1097529
SMILES: CC(C)\N=C1/S\C(=C/c2ccc(CO)cc2)C(=O)N1c1ccccc1
InChI Key: InChIKey=QMGLDHJLQFTSOI-RTPYTOBHSA-N
Data: 2 EC50
Activity Spreadsheet -- Enzyme Inhibition Constant Data from BindingDB
Found 2 hits for monomerid = 50316712
Trg + Lig
Ki
nM
ΔG°
kcal/mole
IC50
nM
Kd
nM
EC50/IC50
nM
koff
s-1
kon
M-1s-1
pHTemp
°C
Sphingosine 1-phosphate receptor 1
(Homo sapiens (Human))
BDBM50316712
((Z,Z)-5-(4-Hydroxymethyl-benzylidene)-2-isopropyli...)
Show SMILES CC(C)\N=C1/S\C(=C/c2ccc(CO)cc2)C(=O)N1c1ccccc1
Show InChI InChI=1S/C20H20N2O2S/c1-14(2)21-20-22(17-6-4-3-5-7-17)19(24)18(25-20)12-15-8-10-16(13-23)11-9-15/h3-12,14,23H,13H2,1-2H3/b18-12-,21-20-
Reactome pathway
n/an/an/an/a 408n/an/an/an/a
Actelion Pharmaceuticals Ltd.
Curated by ChEMBL
Assay Description
Agonist activity at human recombinant S1P1 receptor expressed in CHO cells by GTPgammaS binding assay
J Med Chem 53: 4198-211 (2010)
Article DOI: 10.1021/jm100181s
BindingDB Entry DOI: 10.7270/Q2513ZBQ
Sphingosine 1-phosphate receptor 3
(Homo sapiens (Human))
BDBM50316712
((Z,Z)-5-(4-Hydroxymethyl-benzylidene)-2-isopropyli...)
Show SMILES CC(C)\N=C1/S\C(=C/c2ccc(CO)cc2)C(=O)N1c1ccccc1
Show InChI InChI=1S/C20H20N2O2S/c1-14(2)21-20-22(17-6-4-3-5-7-17)19(24)18(25-20)12-15-8-10-16(13-23)11-9-15/h3-12,14,23H,13H2,1-2H3/b18-12-,21-20-
NCI pathway
Reactome pathway
n/an/an/an/a 86n/an/an/an/a
Actelion Pharmaceuticals Ltd.
Curated by ChEMBL
Assay Description
Agonist activity at human recombinant S1P3 receptor expressed in CHO cells by GTPgammaS binding assay
J Med Chem 53: 4198-211 (2010)
Article DOI: 10.1021/jm100181s
BindingDB Entry DOI: 10.7270/Q2513ZBQ