BDBM50316720 (Z,Z)-5-(4-Bromo-benzylidene)-2-isopropylimino-3-phenyl-thiazolidin-4-one::CHEMBL1098484
SMILES: CC(C)\N=C1/S\C(=C/c2ccc(Br)cc2)C(=O)N1c1ccccc1
InChI Key: InChIKey=VDIGIRMUWSICSH-WJCPARMISA-N
Data: 2 EC50
Activity Spreadsheet -- Enzyme Inhibition Constant Data from BindingDB
Found 2 hits for monomerid = 50316720
Trg + Lig
Ki
nM
ΔG°
kcal/mole
IC50
nM
Kd
nM
EC50/IC50
nM
koff
s-1
kon
M-1s-1
pHTemp
°C
Sphingosine 1-phosphate receptor 1
(Homo sapiens (Human))
BDBM50316720
((Z,Z)-5-(4-Bromo-benzylidene)-2-isopropylimino-3-p...)
Show SMILES CC(C)\N=C1/S\C(=C/c2ccc(Br)cc2)C(=O)N1c1ccccc1
Show InChI InChI=1S/C19H17BrN2OS/c1-13(2)21-19-22(16-6-4-3-5-7-16)18(23)17(24-19)12-14-8-10-15(20)11-9-14/h3-13H,1-2H3/b17-12-,21-19-
Reactome pathway
n/an/an/an/a 1.04E+3n/an/an/an/a
Actelion Pharmaceuticals Ltd.
Curated by ChEMBL
Assay Description
Agonist activity at human recombinant S1P1 receptor expressed in CHO cells by GTPgammaS binding assay
J Med Chem 53: 4198-211 (2010)
Article DOI: 10.1021/jm100181s
BindingDB Entry DOI: 10.7270/Q2513ZBQ
Sphingosine 1-phosphate receptor 3
(Homo sapiens (Human))
BDBM50316720
((Z,Z)-5-(4-Bromo-benzylidene)-2-isopropylimino-3-p...)
Show SMILES CC(C)\N=C1/S\C(=C/c2ccc(Br)cc2)C(=O)N1c1ccccc1
Show InChI InChI=1S/C19H17BrN2OS/c1-13(2)21-19-22(16-6-4-3-5-7-16)18(23)17(24-19)12-14-8-10-15(20)11-9-14/h3-13H,1-2H3/b17-12-,21-19-
NCI pathway
Reactome pathway
n/an/an/an/a 136n/an/an/an/a
Actelion Pharmaceuticals Ltd.
Curated by ChEMBL
Assay Description
Agonist activity at human recombinant S1P3 receptor expressed in CHO cells by GTPgammaS binding assay
J Med Chem 53: 4198-211 (2010)
Article DOI: 10.1021/jm100181s
BindingDB Entry DOI: 10.7270/Q2513ZBQ