BDBM50316726 (Z,Z)-5-(3-Fluoro-4-hydroxy-benzylidene)-2-isopropylimino-3-phenyl-thiazolidin-4-one::CHEMBL1094885
SMILES: CC(C)\N=C1/S\C(=C/c2ccc(O)c(F)c2)C(=O)N1c1ccccc1
InChI Key: InChIKey=WVZSRPQKEDOEQJ-WQZDFCHPSA-N
Data: 2 EC50
Activity Spreadsheet -- Enzyme Inhibition Constant Data from BindingDB
Found 2 hits for monomerid = 50316726
Trg + Lig
Ki
nM
ΔG°
kcal/mole
IC50
nM
Kd
nM
EC50/IC50
nM
koff
s-1
kon
M-1s-1
pHTemp
°C
Sphingosine 1-phosphate receptor 1
(Homo sapiens (Human))
BDBM50316726
((Z,Z)-5-(3-Fluoro-4-hydroxy-benzylidene)-2-isoprop...)
Show SMILES CC(C)\N=C1/S\C(=C/c2ccc(O)c(F)c2)C(=O)N1c1ccccc1
Show InChI InChI=1S/C19H17FN2O2S/c1-12(2)21-19-22(14-6-4-3-5-7-14)18(24)17(25-19)11-13-8-9-16(23)15(20)10-13/h3-12,23H,1-2H3/b17-11-,21-19-
Reactome pathway
n/an/an/an/a 225n/an/an/an/a
Actelion Pharmaceuticals Ltd.
Curated by ChEMBL
Assay Description
Agonist activity at human recombinant S1P1 receptor expressed in CHO cells by GTPgammaS binding assay
J Med Chem 53: 4198-211 (2010)
Article DOI: 10.1021/jm100181s
BindingDB Entry DOI: 10.7270/Q2513ZBQ
Sphingosine 1-phosphate receptor 3
(Homo sapiens (Human))
BDBM50316726
((Z,Z)-5-(3-Fluoro-4-hydroxy-benzylidene)-2-isoprop...)
Show SMILES CC(C)\N=C1/S\C(=C/c2ccc(O)c(F)c2)C(=O)N1c1ccccc1
Show InChI InChI=1S/C19H17FN2O2S/c1-12(2)21-19-22(14-6-4-3-5-7-14)18(24)17(25-19)11-13-8-9-16(23)15(20)10-13/h3-12,23H,1-2H3/b17-11-,21-19-
NCI pathway
Reactome pathway
n/an/an/an/a 99n/an/an/an/a
Actelion Pharmaceuticals Ltd.
Curated by ChEMBL
Assay Description
Agonist activity at human recombinant S1P3 receptor expressed in CHO cells by GTPgammaS binding assay
J Med Chem 53: 4198-211 (2010)
Article DOI: 10.1021/jm100181s
BindingDB Entry DOI: 10.7270/Q2513ZBQ