BDBM50316735 (Z,Z)-5-(3-Chloro-4-hydroxy-benzylidene)-2-isopropylimino-3-(3-methoxy-phenyl)-thiazolidin-4-one::CHEMBL1094699
SMILES: COc1cccc(c1)N1\C(S\C(=C/c2ccc(O)c(Cl)c2)C1=O)=N\C(C)C
InChI Key: InChIKey=MQFYCQGGTLNCQD-KQSCOELBSA-N
Data: 2 EC50
Activity Spreadsheet -- Enzyme Inhibition Constant Data from BindingDB
Found 2 hits for monomerid = 50316735
Trg + Lig
Ki
nM
ΔG°
kcal/mole
IC50
nM
Kd
nM
EC50/IC50
nM
koff
s-1
kon
M-1s-1
pHTemp
°C
Sphingosine 1-phosphate receptor 1
(Homo sapiens (Human))
BDBM50316735
((Z,Z)-5-(3-Chloro-4-hydroxy-benzylidene)-2-isoprop...)
Show SMILES COc1cccc(c1)N1\C(S\C(=C/c2ccc(O)c(Cl)c2)C1=O)=N\C(C)C
Show InChI InChI=1S/C20H19ClN2O3S/c1-12(2)22-20-23(14-5-4-6-15(11-14)26-3)19(25)18(27-20)10-13-7-8-17(24)16(21)9-13/h4-12,24H,1-3H3/b18-10-,22-20-
Reactome pathway
n/an/an/an/a 259n/an/an/an/a
Actelion Pharmaceuticals Ltd.
Curated by ChEMBL
Assay Description
Agonist activity at human recombinant S1P1 receptor expressed in CHO cells by GTPgammaS binding assay
J Med Chem 53: 4198-211 (2010)
Article DOI: 10.1021/jm100181s
BindingDB Entry DOI: 10.7270/Q2513ZBQ
Sphingosine 1-phosphate receptor 3
(Homo sapiens (Human))
BDBM50316735
((Z,Z)-5-(3-Chloro-4-hydroxy-benzylidene)-2-isoprop...)
Show SMILES COc1cccc(c1)N1\C(S\C(=C/c2ccc(O)c(Cl)c2)C1=O)=N\C(C)C
Show InChI InChI=1S/C20H19ClN2O3S/c1-12(2)22-20-23(14-5-4-6-15(11-14)26-3)19(25)18(27-20)10-13-7-8-17(24)16(21)9-13/h4-12,24H,1-3H3/b18-10-,22-20-
NCI pathway
Reactome pathway
n/an/an/an/a 514n/an/an/an/a
Actelion Pharmaceuticals Ltd.
Curated by ChEMBL
Assay Description
Agonist activity at human recombinant S1P3 receptor expressed in CHO cells by GTPgammaS binding assay
J Med Chem 53: 4198-211 (2010)
Article DOI: 10.1021/jm100181s
BindingDB Entry DOI: 10.7270/Q2513ZBQ