BDBM50316737 (Z,Z)-5-(3-Chloro-4-hydroxy-benzylidene)-3-(3-chloro-4-methyl-phenyl)-2-isopropylimino-thiazolidin-4-one::CHEMBL1098143
SMILES: CC(C)\N=C1/S\C(=C/c2ccc(O)c(Cl)c2)C(=O)N1c1ccc(C)c(Cl)c1
InChI Key: InChIKey=FCBWTKPVETVEOT-DOBJMIJASA-N
Data: 2 EC50
Activity Spreadsheet -- Enzyme Inhibition Constant Data from BindingDB
Found 2 hits for monomerid = 50316737
Trg + Lig
Ki
nM
ΔG°
kcal/mole
IC50
nM
Kd
nM
EC50/IC50
nM
koff
s-1
kon
M-1s-1
pHTemp
°C
Sphingosine 1-phosphate receptor 1
(Homo sapiens (Human))
BDBM50316737
((Z,Z)-5-(3-Chloro-4-hydroxy-benzylidene)-3-(3-chlo...)
Show SMILES CC(C)\N=C1/S\C(=C/c2ccc(O)c(Cl)c2)C(=O)N1c1ccc(C)c(Cl)c1
Show InChI InChI=1S/C20H18Cl2N2O2S/c1-11(2)23-20-24(14-6-4-12(3)15(21)10-14)19(26)18(27-20)9-13-5-7-17(25)16(22)8-13/h4-11,25H,1-3H3/b18-9-,23-20-
Reactome pathway
n/an/an/an/a 47n/an/an/an/a
Actelion Pharmaceuticals Ltd.
Curated by ChEMBL
Assay Description
Agonist activity at human recombinant S1P1 receptor expressed in CHO cells by GTPgammaS binding assay
J Med Chem 53: 4198-211 (2010)
Article DOI: 10.1021/jm100181s
BindingDB Entry DOI: 10.7270/Q2513ZBQ
Sphingosine 1-phosphate receptor 3
(Homo sapiens (Human))
BDBM50316737
((Z,Z)-5-(3-Chloro-4-hydroxy-benzylidene)-3-(3-chlo...)
Show SMILES CC(C)\N=C1/S\C(=C/c2ccc(O)c(Cl)c2)C(=O)N1c1ccc(C)c(Cl)c1
Show InChI InChI=1S/C20H18Cl2N2O2S/c1-11(2)23-20-24(14-6-4-12(3)15(21)10-14)19(26)18(27-20)9-13-5-7-17(25)16(22)8-13/h4-11,25H,1-3H3/b18-9-,23-20-
NCI pathway
Reactome pathway
n/an/an/an/a 144n/an/an/an/a
Actelion Pharmaceuticals Ltd.
Curated by ChEMBL
Assay Description
Agonist activity at human recombinant S1P3 receptor expressed in CHO cells by GTPgammaS binding assay
J Med Chem 53: 4198-211 (2010)
Article DOI: 10.1021/jm100181s
BindingDB Entry DOI: 10.7270/Q2513ZBQ