BDBM50316855 4'-(4-Nitrobenzensulfonamide)-4-hydroxychalcone::CHEMBL1087324
SMILES: Oc1ccc(\C=C\C(=O)c2ccc(NS(=O)(=O)c3ccc(cc3)[N+]([O-])=O)cc2)cc1
InChI Key: InChIKey=WQIGNJDEMJBAFL-LZWSPWQCSA-N
Data: 1 KI  1 IC50
Activity Spreadsheet -- Enzyme Inhibition Constant Data from BindingDB
Found 2 hits for monomerid = 50316855
Trg + Lig
Ki
nM
ΔG°
kcal/mole
IC50
nM
Kd
nM
EC50/IC50
nM
koff
s-1
kon
M-1s-1
pHTemp
°C
Tyrosinase
(Agaricus bisporus (Common mushroom))
BDBM50316855
(4'-(4-Nitrobenzensulfonamide)-4-hydroxychalcone | ...)
Show SMILES Oc1ccc(\C=C\C(=O)c2ccc(NS(=O)(=O)c3ccc(cc3)[N+]([O-])=O)cc2)cc1
Show InChI InChI=1S/C21H16N2O6S/c24-19-10-1-15(2-11-19)3-14-21(25)16-4-6-17(7-5-16)22-30(28,29)20-12-8-18(9-13-20)23(26)27/h1-14,22,24H/b14-3+
1.14E+4n/an/an/an/an/an/an/an/a
Department of Functional Crop
Curated by ChEMBL
Assay Description
Competitive inhibition of monophenolase activity of mushroom tyrosinase using as L-tyrosine substrate by Lineweaver-Burk plot analysis
Eur J Med Chem 45: 2010-7 (2010)
Article DOI: 10.1016/j.ejmech.2010.01.049
BindingDB Entry DOI: 10.7270/Q2H70FZM
Tyrosinase
(Agaricus bisporus (Common mushroom))
BDBM50316855
(4'-(4-Nitrobenzensulfonamide)-4-hydroxychalcone | ...)
Show SMILES Oc1ccc(\C=C\C(=O)c2ccc(NS(=O)(=O)c3ccc(cc3)[N+]([O-])=O)cc2)cc1
Show InChI InChI=1S/C21H16N2O6S/c24-19-10-1-15(2-11-19)3-14-21(25)16-4-6-17(7-5-16)22-30(28,29)20-12-8-18(9-13-20)23(26)27/h1-14,22,24H/b14-3+
n/an/a 1.52E+4n/an/an/an/an/an/a
Department of Functional Crop
Curated by ChEMBL
Assay Description
Inhibition of monophenolase activity of mushroom tyrosinase using as L-tyrosine substrate by spectrophotometric analysis
Eur J Med Chem 45: 2010-7 (2010)
Article DOI: 10.1016/j.ejmech.2010.01.049
BindingDB Entry DOI: 10.7270/Q2H70FZM