BDBM50316864 CHEMBL1099361::[(2R,4S,5S)-5-(N-Boc-L-leucyl-L-phenylalanylamido)-4-hydroxy-2,7-dimethyloctal]N'-isobutyl amide
SMILES: CC(C)CNC(=O)[C@H](C)C[C@H](O)[C@H](CC(C)C)NC(=O)[C@H](Cc1ccccc1)NC(=O)[C@H](CC(C)C)NC(=O)OC(C)(C)C
InChI Key: InChIKey=QOCDRKDIKYEXFE-QDXQZTBOSA-N
Data: 1 IC50
Activity Spreadsheet -- Enzyme Inhibition Constant Data from BindingDB
Found 1 hit for monomerid = 50316864
Trg + Lig
Ki
nM
ΔG°
kcal/mole
IC50
nM
Kd
nM
EC50/IC50
nM
koff
s-1
kon
M-1s-1
pHTemp
°C
Beta-secretase 1
(Homo sapiens (Human))
BDBM50316864
(CHEMBL1099361 | [(2R,4S,5S)-5-(N-Boc-L-leucyl-L-ph...)
Show SMILES CC(C)CNC(=O)[C@H](C)C[C@H](O)[C@H](CC(C)C)NC(=O)[C@H](Cc1ccccc1)NC(=O)[C@H](CC(C)C)NC(=O)OC(C)(C)C |r|
Show InChI InChI=1S/C34H58N4O6/c1-21(2)16-26(29(39)18-24(7)30(40)35-20-23(5)6)36-32(42)28(19-25-14-12-11-13-15-25)37-31(41)27(17-22(3)4)38-33(43)44-34(8,9)10/h11-15,21-24,26-29,39H,16-20H2,1-10H3,(H,35,40)(H,36,42)(H,37,41)(H,38,43)/t24-,26+,27+,28+,29+/m1/s1
n/an/a 2.31E+3n/an/an/an/an/an/a
Peking University
Curated by ChEMBL
Assay Description
Inhibition of human recombinant BACE1 using fluorescent peptide substrate after 5 mins
Eur J Med Chem 45: 2089-94 (2010)
Article DOI: 10.1016/j.ejmech.2010.01.044
BindingDB Entry DOI: 10.7270/Q2CF9Q86