BDBM50316866 CHEMBL1087736::N-((S)-1-((4S,5S,7R)-5-hydroxy-8-(isobutylamino)-2,7-dimethyl-8-oxooctan-4-ylamino)-1-oxo-3-phenylpropan-2-yl)-4-nitrobenzamide
SMILES: CC(C)CNC(=O)[C@H](C)C[C@H](O)[C@H](CC(C)C)NC(=O)[C@H](Cc1ccccc1)NC(=O)c1ccc(cc1)[N+]([O-])=O
InChI Key: InChIKey=DJFBJFNKECFROO-FBZFJNBBSA-N
Data: 1 IC50
Activity Spreadsheet -- Enzyme Inhibition Constant Data from BindingDB
Found 1 hit for monomerid = 50316866
Trg + Lig
Ki
nM
ΔG°
kcal/mole
IC50
nM
Kd
nM
EC50/IC50
nM
koff
s-1
kon
M-1s-1
pHTemp
°C
Beta-secretase 1
(Homo sapiens (Human))
BDBM50316866
(CHEMBL1087736 | N-((S)-1-((4S,5S,7R)-5-hydroxy-8-(...)
Show SMILES CC(C)CNC(=O)[C@H](C)C[C@H](O)[C@H](CC(C)C)NC(=O)[C@H](Cc1ccccc1)NC(=O)c1ccc(cc1)[N+]([O-])=O |r|
Show InChI InChI=1S/C30H42N4O6/c1-19(2)15-25(27(35)16-21(5)28(36)31-18-20(3)4)32-30(38)26(17-22-9-7-6-8-10-22)33-29(37)23-11-13-24(14-12-23)34(39)40/h6-14,19-21,25-27,35H,15-18H2,1-5H3,(H,31,36)(H,32,38)(H,33,37)/t21-,25+,26+,27+/m1/s1
n/an/a 1.57E+4n/an/an/an/an/an/a
Peking University
Curated by ChEMBL
Assay Description
Inhibition of human recombinant BACE1 using fluorescent peptide substrate after 5 mins
Eur J Med Chem 45: 2089-94 (2010)
Article DOI: 10.1016/j.ejmech.2010.01.044
BindingDB Entry DOI: 10.7270/Q2CF9Q86