BDBM50317112 2-((3-((2-(4-fluorophenyl)oxazol-4-yl)methoxy)benzyl)(methoxycarbonyl)amino)acetic acid::CHEMBL1087580
SMILES: COC(=O)N(CC(O)=O)Cc1cccc(OCc2coc(n2)-c2ccc(F)cc2)c1
InChI Key: InChIKey=NSZVZFDEDFPQKZ-UHFFFAOYSA-N
Data: 2 EC50
Activity Spreadsheet -- Enzyme Inhibition Constant Data from BindingDB
Found 2 hits for monomerid = 50317112
Trg + Lig
Ki
nM
ΔG°
kcal/mole
IC50
nM
Kd
nM
EC50/IC50
nM
koff
s-1
kon
M-1s-1
pHTemp
°C
Peroxisome proliferator-activated receptor alpha
(Homo sapiens (Human))
BDBM50317112
(2-((3-((2-(4-fluorophenyl)oxazol-4-yl)methoxy)benz...)
Show SMILES COC(=O)N(CC(O)=O)Cc1cccc(OCc2coc(n2)-c2ccc(F)cc2)c1
Show InChI InChI=1S/C21H19FN2O6/c1-28-21(27)24(11-19(25)26)10-14-3-2-4-18(9-14)29-12-17-13-30-20(23-17)15-5-7-16(22)8-6-15/h2-9,13H,10-12H2,1H3,(H,25,26)
n/an/an/an/a 235n/an/an/an/a
Bristol-Myers Squibb R&D
Curated by ChEMBL
Assay Description
Agonist activity against human Gal4-fussed PPARalpha in HEK293 cells by luciferase reporter gene assay
Bioorg Med Chem Lett 20: 2933-7 (2010)
Article DOI: 10.1016/j.bmcl.2010.03.019
BindingDB Entry DOI: 10.7270/Q2K35TS2
Peroxisome proliferator-activated receptor gamma
(Homo sapiens (Human))
BDBM50317112
(2-((3-((2-(4-fluorophenyl)oxazol-4-yl)methoxy)benz...)
Show SMILES COC(=O)N(CC(O)=O)Cc1cccc(OCc2coc(n2)-c2ccc(F)cc2)c1
Show InChI InChI=1S/C21H19FN2O6/c1-28-21(27)24(11-19(25)26)10-14-3-2-4-18(9-14)29-12-17-13-30-20(23-17)15-5-7-16(22)8-6-15/h2-9,13H,10-12H2,1H3,(H,25,26)
NCI pathway
Reactome pathway
n/an/an/an/a>2.50E+4n/an/an/an/a
Bristol-Myers Squibb R&D
Curated by ChEMBL
Assay Description
Agonist activity against human Gal4-fussed PPARgamma in HEK293 cells by luciferase reporter gene assay
Bioorg Med Chem Lett 20: 2933-7 (2010)
Article DOI: 10.1016/j.bmcl.2010.03.019
BindingDB Entry DOI: 10.7270/Q2K35TS2