BDBM50317121 2-(methoxycarbonyl(3-((2-p-tolylthiazol-4-yl)methoxy)benzyl)amino)acetic acid::CHEMBL1087593
SMILES: COC(=O)N(CC(O)=O)Cc1cccc(OCc2csc(n2)-c2ccc(C)cc2)c1
InChI Key: InChIKey=ZQLIPSJTSQQHGB-UHFFFAOYSA-N
Data: 2 EC50
Activity Spreadsheet -- Enzyme Inhibition Constant Data from BindingDB
Found 2 hits for monomerid = 50317121
Trg + Lig
Ki
nM
ΔG°
kcal/mole
IC50
nM
Kd
nM
EC50/IC50
nM
koff
s-1
kon
M-1s-1
pHTemp
°C
Peroxisome proliferator-activated receptor alpha
(Homo sapiens (Human))
BDBM50317121
(2-(methoxycarbonyl(3-((2-p-tolylthiazol-4-yl)metho...)
Show SMILES COC(=O)N(CC(O)=O)Cc1cccc(OCc2csc(n2)-c2ccc(C)cc2)c1
Show InChI InChI=1S/C22H22N2O5S/c1-15-6-8-17(9-7-15)21-23-18(14-30-21)13-29-19-5-3-4-16(10-19)11-24(12-20(25)26)22(27)28-2/h3-10,14H,11-13H2,1-2H3,(H,25,26)
n/an/an/an/a 41.8n/an/an/an/a
Bristol-Myers Squibb R&D
Curated by ChEMBL
Assay Description
Agonist activity against human Gal4-fussed PPARalpha in HEK293 cells by luciferase reporter gene assay
Bioorg Med Chem Lett 20: 2933-7 (2010)
Article DOI: 10.1016/j.bmcl.2010.03.019
BindingDB Entry DOI: 10.7270/Q2K35TS2
Peroxisome proliferator-activated receptor gamma
(Homo sapiens (Human))
BDBM50317121
(2-(methoxycarbonyl(3-((2-p-tolylthiazol-4-yl)metho...)
Show SMILES COC(=O)N(CC(O)=O)Cc1cccc(OCc2csc(n2)-c2ccc(C)cc2)c1
Show InChI InChI=1S/C22H22N2O5S/c1-15-6-8-17(9-7-15)21-23-18(14-30-21)13-29-19-5-3-4-16(10-19)11-24(12-20(25)26)22(27)28-2/h3-10,14H,11-13H2,1-2H3,(H,25,26)
NCI pathway
Reactome pathway
n/an/an/an/a 9.29E+3n/an/an/an/a
Bristol-Myers Squibb R&D
Curated by ChEMBL
Assay Description
Agonist activity against human Gal4-fussed PPARgamma in HEK293 cells by luciferase reporter gene assay
Bioorg Med Chem Lett 20: 2933-7 (2010)
Article DOI: 10.1016/j.bmcl.2010.03.019
BindingDB Entry DOI: 10.7270/Q2K35TS2