BDBM50317163 (2'Z,3'E)-5-Fluoro-5'-hydroxy-indirubin-3'-oxime::CHEMBL1086662
SMILES: Oc1ccc2[nH]c(C3C(=O)Nc4ccc(F)cc34)c(N=O)c2c1
InChI Key: InChIKey=GFNDSUXLMMQBIH-UHFFFAOYSA-N
Data: 1 IC50
Activity Spreadsheet -- Enzyme Inhibition Constant Data from BindingDB
Found 1 hit for monomerid = 50317163
Trg + Lig
Ki
nM
ΔG°
kcal/mole
IC50
nM
Kd
nM
EC50/IC50
nM
koff
s-1
kon
M-1s-1
pHTemp
°C
CDK2/CycE
(Homo sapiens (Human))
BDBM50317163
((2'Z,3'E)-5-Fluoro-5'-hydroxy-indirubin-3'-oxime |...)
Show SMILES Oc1ccc2[nH]c(C3C(=O)Nc4ccc(F)cc34)c(N=O)c2c1
Show InChI InChI=1S/C16H10FN3O3/c17-7-1-3-11-9(5-7)13(16(22)19-11)15-14(20-23)10-6-8(21)2-4-12(10)18-15/h1-6,13,18,21H,(H,19,22)
n/an/a 2.30n/an/an/an/an/an/a
Institute of Science and Technology
Curated by ChEMBL
Assay Description
Inhibition of CDK2/cyclin E
J Med Chem 53: 3696-706 (2010)
Article DOI: 10.1021/jm100080z
BindingDB Entry DOI: 10.7270/Q2X92BFT