BDBM50317624 4-(2-(2-carboxyethyl)-3-(6-(4,6-diphenylpyridin-2-yloxy)hexyl)phenoxy)butanoic acid::CHEMBL1099330
SMILES: OC(=O)CCCOc1cccc(CCCCCCOc2cc(cc(n2)-c2ccccc2)-c2ccccc2)c1CCC(O)=O
InChI Key: InChIKey=IQMZIBZJCFEUSM-UHFFFAOYSA-N
Data: 9 IC50
Activity Spreadsheet -- Enzyme Inhibition Constant Data from BindingDB
Found 9 hits for monomerid = 50317624
Trg + Lig
Ki
nM
ΔG°
kcal/mole
IC50
nM
Kd
nM
EC50/IC50
nM
koff
s-1
kon
M-1s-1
pHTemp
°C
Leukotriene B4 receptor
(Homo sapiens (Human))
BDBM50317624
(4-(2-(2-carboxyethyl)-3-(6-(4,6-diphenylpyridin-2-...)
Show SMILES OC(=O)CCCOc1cccc(CCCCCCOc2cc(cc(n2)-c2ccccc2)-c2ccccc2)c1CCC(O)=O
Show InChI InChI=1S/C36H39NO6/c38-35(39)20-12-24-42-33-19-11-18-28(31(33)21-22-36(40)41)15-5-1-2-10-23-43-34-26-30(27-13-6-3-7-14-27)25-32(37-34)29-16-8-4-9-17-29/h3-4,6-9,11,13-14,16-19,25-26H,1-2,5,10,12,15,20-24H2,(H,38,39)(H,40,41)
n/an/a 205n/an/an/an/an/an/a
Roche Research Center
Curated by ChEMBL
Assay Description
Antagonist activity at FLAG-tagged human BLT1 receptor expressed in HEK293 cells assessed as inhibition of LTB4-stimulated calcium mobilization prein...
J Med Chem 53: 3502-16 (2010)
Article DOI: 10.1021/jm1001919
BindingDB Entry DOI: 10.7270/Q2KW5G67
Leukotriene 2
(Homo sapiens (Human))
BDBM50317624
(4-(2-(2-carboxyethyl)-3-(6-(4,6-diphenylpyridin-2-...)
Show SMILES OC(=O)CCCOc1cccc(CCCCCCOc2cc(cc(n2)-c2ccccc2)-c2ccccc2)c1CCC(O)=O
Show InChI InChI=1S/C36H39NO6/c38-35(39)20-12-24-42-33-19-11-18-28(31(33)21-22-36(40)41)15-5-1-2-10-23-43-34-26-30(27-13-6-3-7-14-27)25-32(37-34)29-16-8-4-9-17-29/h3-4,6-9,11,13-14,16-19,25-26H,1-2,5,10,12,15,20-24H2,(H,38,39)(H,40,41)
n/an/a 3.06E+3n/an/an/an/an/an/a
Roche Research Center
Curated by ChEMBL
Assay Description
Antagonist activity at FLAG-tagged human BLT2 receptor expressed in HEK293 cells assessed as inhibition of LTB4-stimulated calcium mobilization prein...
J Med Chem 53: 3502-16 (2010)
Article DOI: 10.1021/jm1001919
BindingDB Entry DOI: 10.7270/Q2KW5G67
Cytochrome P450 2C9
(Homo sapiens (Human))
BDBM50317624
(4-(2-(2-carboxyethyl)-3-(6-(4,6-diphenylpyridin-2-...)
Show SMILES OC(=O)CCCOc1cccc(CCCCCCOc2cc(cc(n2)-c2ccccc2)-c2ccccc2)c1CCC(O)=O
Show InChI InChI=1S/C36H39NO6/c38-35(39)20-12-24-42-33-19-11-18-28(31(33)21-22-36(40)41)15-5-1-2-10-23-43-34-26-30(27-13-6-3-7-14-27)25-32(37-34)29-16-8-4-9-17-29/h3-4,6-9,11,13-14,16-19,25-26H,1-2,5,10,12,15,20-24H2,(H,38,39)(H,40,41)
Reactome pathway
n/an/a>1.25E+4n/an/an/an/an/an/a
Roche Research Center
Curated by ChEMBL
Assay Description
Inhibition of CYP2C9 fluorescence method
J Med Chem 53: 3502-16 (2010)
Article DOI: 10.1021/jm1001919
BindingDB Entry DOI: 10.7270/Q2KW5G67
Potassium voltage-gated channel subfamily H member 2
(Homo sapiens (Human))
BDBM50317624
(4-(2-(2-carboxyethyl)-3-(6-(4,6-diphenylpyridin-2-...)
Show SMILES OC(=O)CCCOc1cccc(CCCCCCOc2cc(cc(n2)-c2ccccc2)-c2ccccc2)c1CCC(O)=O
Show InChI InChI=1S/C36H39NO6/c38-35(39)20-12-24-42-33-19-11-18-28(31(33)21-22-36(40)41)15-5-1-2-10-23-43-34-26-30(27-13-6-3-7-14-27)25-32(37-34)29-16-8-4-9-17-29/h3-4,6-9,11,13-14,16-19,25-26H,1-2,5,10,12,15,20-24H2,(H,38,39)(H,40,41)
Reactome pathway
n/an/a>3.00E+3n/an/an/an/an/an/a
Roche Research Center
Curated by ChEMBL
Assay Description
Inhibition of human ERG expressed in CHO cells assessed as reduction of current amplitude
J Med Chem 53: 3502-16 (2010)
Article DOI: 10.1021/jm1001919
BindingDB Entry DOI: 10.7270/Q2KW5G67
Leukotriene B4 receptor
(Homo sapiens (Human))
BDBM50317624
(4-(2-(2-carboxyethyl)-3-(6-(4,6-diphenylpyridin-2-...)
Show SMILES OC(=O)CCCOc1cccc(CCCCCCOc2cc(cc(n2)-c2ccccc2)-c2ccccc2)c1CCC(O)=O
Show InChI InChI=1S/C36H39NO6/c38-35(39)20-12-24-42-33-19-11-18-28(31(33)21-22-36(40)41)15-5-1-2-10-23-43-34-26-30(27-13-6-3-7-14-27)25-32(37-34)29-16-8-4-9-17-29/h3-4,6-9,11,13-14,16-19,25-26H,1-2,5,10,12,15,20-24H2,(H,38,39)(H,40,41)
n/an/a 0.480n/an/an/an/an/an/a
Roche Research Center
Curated by ChEMBL
Assay Description
Antagonist activity at BLT1 receptor expressed in human HL60 cells assessed as inhibition of LTB4-stimulated calcium flux after 30 mins
J Med Chem 53: 3502-16 (2010)
Article DOI: 10.1021/jm1001919
BindingDB Entry DOI: 10.7270/Q2KW5G67
Cytochrome P450 2D6
(Homo sapiens (Human))
BDBM50317624
(4-(2-(2-carboxyethyl)-3-(6-(4,6-diphenylpyridin-2-...)
Show SMILES OC(=O)CCCOc1cccc(CCCCCCOc2cc(cc(n2)-c2ccccc2)-c2ccccc2)c1CCC(O)=O
Show InChI InChI=1S/C36H39NO6/c38-35(39)20-12-24-42-33-19-11-18-28(31(33)21-22-36(40)41)15-5-1-2-10-23-43-34-26-30(27-13-6-3-7-14-27)25-32(37-34)29-16-8-4-9-17-29/h3-4,6-9,11,13-14,16-19,25-26H,1-2,5,10,12,15,20-24H2,(H,38,39)(H,40,41)
n/an/a>7.50E+3n/an/an/an/an/an/a
Roche Research Center
Curated by ChEMBL
Assay Description
Inhibition of CYP2D6 flourescence method
J Med Chem 53: 3502-16 (2010)
Article DOI: 10.1021/jm1001919
BindingDB Entry DOI: 10.7270/Q2KW5G67
Cytochrome P450 2C19
(Homo sapiens (Human))
BDBM50317624
(4-(2-(2-carboxyethyl)-3-(6-(4,6-diphenylpyridin-2-...)
Show SMILES OC(=O)CCCOc1cccc(CCCCCCOc2cc(cc(n2)-c2ccccc2)-c2ccccc2)c1CCC(O)=O
Show InChI InChI=1S/C36H39NO6/c38-35(39)20-12-24-42-33-19-11-18-28(31(33)21-22-36(40)41)15-5-1-2-10-23-43-34-26-30(27-13-6-3-7-14-27)25-32(37-34)29-16-8-4-9-17-29/h3-4,6-9,11,13-14,16-19,25-26H,1-2,5,10,12,15,20-24H2,(H,38,39)(H,40,41)
Reactome pathway
n/an/a>7.50E+3n/an/an/an/an/an/a
Roche Research Center
Curated by ChEMBL
Assay Description
Inhibition of CYP2C19 flourescence method
J Med Chem 53: 3502-16 (2010)
Article DOI: 10.1021/jm1001919
BindingDB Entry DOI: 10.7270/Q2KW5G67
Cytochrome P450 3A4
(Homo sapiens (Human))
BDBM50317624
(4-(2-(2-carboxyethyl)-3-(6-(4,6-diphenylpyridin-2-...)
Show SMILES OC(=O)CCCOc1cccc(CCCCCCOc2cc(cc(n2)-c2ccccc2)-c2ccccc2)c1CCC(O)=O
Show InChI InChI=1S/C36H39NO6/c38-35(39)20-12-24-42-33-19-11-18-28(31(33)21-22-36(40)41)15-5-1-2-10-23-43-34-26-30(27-13-6-3-7-14-27)25-32(37-34)29-16-8-4-9-17-29/h3-4,6-9,11,13-14,16-19,25-26H,1-2,5,10,12,15,20-24H2,(H,38,39)(H,40,41)
Reactome pathway
n/an/a>7.50E+3n/an/an/an/an/an/a
Roche Research Center
Curated by ChEMBL
Assay Description
Inhibition of CYP3A4 fluorescence method
J Med Chem 53: 3502-16 (2010)
Article DOI: 10.1021/jm1001919
BindingDB Entry DOI: 10.7270/Q2KW5G67
Cytochrome P450 1A
(Homo sapiens (Human))
BDBM50317624
(4-(2-(2-carboxyethyl)-3-(6-(4,6-diphenylpyridin-2-...)
Show SMILES OC(=O)CCCOc1cccc(CCCCCCOc2cc(cc(n2)-c2ccccc2)-c2ccccc2)c1CCC(O)=O
Show InChI InChI=1S/C36H39NO6/c38-35(39)20-12-24-42-33-19-11-18-28(31(33)21-22-36(40)41)15-5-1-2-10-23-43-34-26-30(27-13-6-3-7-14-27)25-32(37-34)29-16-8-4-9-17-29/h3-4,6-9,11,13-14,16-19,25-26H,1-2,5,10,12,15,20-24H2,(H,38,39)(H,40,41)
Reactome pathway
n/an/a>7.50E+3n/an/an/an/an/an/a
Roche Research Center
Curated by ChEMBL
Assay Description
Inhibition of CYP1A2 by fluorescence method
J Med Chem 53: 3502-16 (2010)
Article DOI: 10.1021/jm1001919
BindingDB Entry DOI: 10.7270/Q2KW5G67