BDBM50317831 3-(4-chlorophenethyl)5-methyl 2,6-dimethyl-4-(3-nitrophenyl)-1,4-dihydropyridine-3,5-dicarboxylate::CHEMBL1096841
SMILES: COC(=O)C1C(C(C(=O)OCCc2ccc(Cl)cc2)=C(C)N=C1C)c1cccc(c1)[N+]([O-])=O
InChI Key: InChIKey=HRKDEIBQPPISRN-UHFFFAOYSA-N
Data: 2 IC50
Activity Spreadsheet -- Enzyme Inhibition Constant Data from BindingDB
Found 2 hits for monomerid = 50317831
Trg + Lig
Ki
nM
ΔG°
kcal/mole
IC50
nM
Kd
nM
EC50/IC50
nM
koff
s-1
kon
M-1s-1
pHTemp
°C
Voltage-gated L-type calcium channel alpha-1C subunit
(Oryctolagus cuniculus)
BDBM50317831
(3-(4-chlorophenethyl)5-methyl 2,6-dimethyl-4-(3-ni...)
Show SMILES COC(=O)C1C(C(C(=O)OCCc2ccc(Cl)cc2)=C(C)N=C1C)c1cccc(c1)[N+]([O-])=O |c:22,t:19|
Show InChI InChI=1S/C24H23ClN2O6/c1-14-20(23(28)32-3)22(17-5-4-6-19(13-17)27(30)31)21(15(2)26-14)24(29)33-12-11-16-7-9-18(25)10-8-16/h4-10,13,20,22H,11-12H2,1-3H3
Reactome pathway
n/an/a 8n/an/an/an/an/an/a
Northwestern University
Curated by ChEMBL
Assay Description
Antagonist activity at rabbit Cav1.2 expressed in HEK293 cells assessed as inhibition of voltage pulse-induced calcium current by FLIPR calcium 4 ass...
Bioorg Med Chem 18: 3147-58 (2010)
Article DOI: 10.1016/j.bmc.2010.03.038
BindingDB Entry DOI: 10.7270/Q2F47P90
Cav1.3/Cav beta3/Cav alpha2delta complex
(Rattus norvegicus)
BDBM50317831
(3-(4-chlorophenethyl)5-methyl 2,6-dimethyl-4-(3-ni...)
Show SMILES COC(=O)C1C(C(C(=O)OCCc2ccc(Cl)cc2)=C(C)N=C1C)c1cccc(c1)[N+]([O-])=O |c:22,t:19|
Show InChI InChI=1S/C24H23ClN2O6/c1-14-20(23(28)32-3)22(17-5-4-6-19(13-17)27(30)31)21(15(2)26-14)24(29)33-12-11-16-7-9-18(25)10-8-16/h4-10,13,20,22H,11-12H2,1-3H3
Reactome pathway
n/an/a 39n/an/an/an/an/an/a
Northwestern University
Curated by ChEMBL
Assay Description
Antagonist activity at rat Cav1.3 expressed in HEK293 cells assessed as inhibition of voltage pulse-induced calcium current by FLIPR calcium 4 assay
Bioorg Med Chem 18: 3147-58 (2010)
Article DOI: 10.1016/j.bmc.2010.03.038
BindingDB Entry DOI: 10.7270/Q2F47P90