BDBM50317841 CHEMBL1094352::diethyl 4-(2,4-difluorophenyl)-2,6-dimethyl-1,4-dihydropyridine-3,5-dicarboxylate
SMILES: CCOC(=O)C1C(C(C(=O)OCC)=C(C)N=C1C)c1ccc(F)cc1F
InChI Key: InChIKey=ANVDFHUXDDOQOT-UHFFFAOYSA-N
Data: 2 IC50
Activity Spreadsheet -- Enzyme Inhibition Constant Data from BindingDB
Found 2 hits for monomerid = 50317841
Trg + Lig
Ki
nM
ΔG°
kcal/mole
IC50
nM
Kd
nM
EC50/IC50
nM
koff
s-1
kon
M-1s-1
pHTemp
°C
Voltage-gated L-type calcium channel alpha-1C subunit
(Oryctolagus cuniculus)
BDBM50317841
(CHEMBL1094352 | diethyl 4-(2,4-difluorophenyl)-2,6...)
Show SMILES CCOC(=O)C1C(C(C(=O)OCC)=C(C)N=C1C)c1ccc(F)cc1F |c:15,t:12|
Show InChI InChI=1S/C19H21F2NO4/c1-5-25-18(23)15-10(3)22-11(4)16(19(24)26-6-2)17(15)13-8-7-12(20)9-14(13)21/h7-9,15,17H,5-6H2,1-4H3
Reactome pathway
n/an/a 20n/an/an/an/an/an/a
Northwestern University
Curated by ChEMBL
Assay Description
Antagonist activity at rabbit Cav1.2 expressed in HEK293 cells assessed as inhibition of voltage pulse-induced calcium current by FLIPR calcium 4 ass...
Bioorg Med Chem 18: 3147-58 (2010)
Article DOI: 10.1016/j.bmc.2010.03.038
BindingDB Entry DOI: 10.7270/Q2F47P90
Cav1.3/Cav beta3/Cav alpha2delta complex
(Rattus norvegicus)
BDBM50317841
(CHEMBL1094352 | diethyl 4-(2,4-difluorophenyl)-2,6...)
Show SMILES CCOC(=O)C1C(C(C(=O)OCC)=C(C)N=C1C)c1ccc(F)cc1F |c:15,t:12|
Show InChI InChI=1S/C19H21F2NO4/c1-5-25-18(23)15-10(3)22-11(4)16(19(24)26-6-2)17(15)13-8-7-12(20)9-14(13)21/h7-9,15,17H,5-6H2,1-4H3
Reactome pathway
n/an/a 58n/an/an/an/an/an/a
Northwestern University
Curated by ChEMBL
Assay Description
Antagonist activity at rat Cav1.3 expressed in HEK293 cells assessed as inhibition of voltage pulse-induced calcium current by FLIPR calcium 4 assay
Bioorg Med Chem 18: 3147-58 (2010)
Article DOI: 10.1016/j.bmc.2010.03.038
BindingDB Entry DOI: 10.7270/Q2F47P90