null
SMILES: C(Cc1cnc[nH]1)NC1CCCCC1
InChI Key: InChIKey=OKJFYIHINPOKMF-UHFFFAOYSA-N
Activity Spreadsheet -- Enzyme Inhibition Constant Data from BindingDB
Found 2 hits for monomerid = 50317872
Trg + Lig
Ki
nM
ΔG°
kcal/mole
IC50
nM
Kd
nM
EC50/IC50
nM
koff
s-1
kon
M-1s-1
pHTemp
°C
Histamine H3 receptor
(Homo sapiens (Human))
BDBM50317872
(4-(2-(Cyclohexylamino)ethyl)-1H-imidazole | CHEMBL...)
Show SMILES C(Cc1cnc[nH]1)NC1CCCCC1
Show InChI InChI=1S/C11H19N3/c1-2-4-10(5-3-1)13-7-6-11-8-12-9-14-11/h8-10,13H,1-7H2,(H,12,14)
Reactome pathway
1.60E+3n/an/an/an/an/an/an/an/a
Meiji Seika Kaisha, Ltd.
Curated by ChEMBL
Assay Description
Displacement of [3H[N-alpha-methylhistamine form human recombinant histamine H3 receptor expressed in CHO cells after 1 hr by liquid scintillation co...
J Med Chem 53: 3840-4 (2010)
Article DOI: 10.1021/jm901890s
BindingDB Entry DOI: 10.7270/Q21Z44KC
Histamine H3 receptor
(Homo sapiens (Human))
BDBM50317872
(4-(2-(Cyclohexylamino)ethyl)-1H-imidazole | CHEMBL...)
Show SMILES C(Cc1cnc[nH]1)NC1CCCCC1
Show InChI InChI=1S/C11H19N3/c1-2-4-10(5-3-1)13-7-6-11-8-12-9-14-11/h8-10,13H,1-7H2,(H,12,14)
Reactome pathway
n/an/an/an/a 3.40E+3n/an/an/an/a
Meiji Seika Kaisha, Ltd.
Curated by ChEMBL
Assay Description
Agonist activity at human recombinant histamine H3 receptor expressed in CHO cells assessed as [35S]GTPgammaS binding after 1 hr by liquid scintillat...
J Med Chem 53: 3840-4 (2010)
Article DOI: 10.1021/jm901890s
BindingDB Entry DOI: 10.7270/Q21Z44KC