BDBM50318064 8-{[2-(Acetylamino)phenyl]amino}-1-methyl-4,5-dihydro-1Hpyrazolo[4,3-h]quinazoline-3-carboxamide::CHEMBL1097373
SMILES: CC(=O)Nc1ccccc1Nc1ncc2CCc3c(nn(C)c3-c2n1)C(N)=O
InChI Key: InChIKey=KNXOPPMRMUDBIP-UHFFFAOYSA-N
Data: 5 IC50
Activity Spreadsheet -- Enzyme Inhibition Constant Data from BindingDB
Found 5 hits for monomerid = 50318064
Trg + Lig
Ki
nM
ΔG°
kcal/mole
IC50
nM
Kd
nM
EC50/IC50
nM
koff
s-1
kon
M-1s-1
pHTemp
°C
CDK2/Cyclin A/Cyclin A1
(Homo sapiens (Human))
BDBM50318064
(8-{[2-(Acetylamino)phenyl]amino}-1-methyl-4,5-dihy...)
Show SMILES CC(=O)Nc1ccccc1Nc1ncc2CCc3c(nn(C)c3-c2n1)C(N)=O
Show InChI InChI=1S/C19H19N7O2/c1-10(27)22-13-5-3-4-6-14(13)23-19-21-9-11-7-8-12-16(18(20)28)25-26(2)17(12)15(11)24-19/h3-6,9H,7-8H2,1-2H3,(H2,20,28)(H,22,27)(H,21,23,24)
Reactome pathway
n/an/a 1.04E+3n/an/an/an/an/an/a
Nerviano Medical Sciences Srl
Curated by ChEMBL
Assay Description
Inhibition of CDK2/Cyclin A assessed as [33P]gamma-ATP incorporation into substrate after 60 mins by gamma counting
J Med Chem 53: 3532-51 (2010)
Article DOI: 10.1021/jm901713n
BindingDB Entry DOI: 10.7270/Q2RF5V5D
Serine/threonine-protein kinase PLK3
(Homo sapiens (Human))
BDBM50318064
(8-{[2-(Acetylamino)phenyl]amino}-1-methyl-4,5-dihy...)
Show SMILES CC(=O)Nc1ccccc1Nc1ncc2CCc3c(nn(C)c3-c2n1)C(N)=O
Show InChI InChI=1S/C19H19N7O2/c1-10(27)22-13-5-3-4-6-14(13)23-19-21-9-11-7-8-12-16(18(20)28)25-26(2)17(12)15(11)24-19/h3-6,9H,7-8H2,1-2H3,(H2,20,28)(H,22,27)(H,21,23,24)
NCI pathway
n/an/a 49n/an/an/an/an/an/a
Nerviano Medical Sciences Srl
Curated by ChEMBL
Assay Description
Inhibition of Plk3 assessed as [33P]gamma-ATP incorporation into substrate after 60 mins by gamma counting
J Med Chem 53: 3532-51 (2010)
Article DOI: 10.1021/jm901713n
BindingDB Entry DOI: 10.7270/Q2RF5V5D
Aurora kinase A
(Homo sapiens (Human))
BDBM50318064
(8-{[2-(Acetylamino)phenyl]amino}-1-methyl-4,5-dihy...)
Show SMILES CC(=O)Nc1ccccc1Nc1ncc2CCc3c(nn(C)c3-c2n1)C(N)=O
Show InChI InChI=1S/C19H19N7O2/c1-10(27)22-13-5-3-4-6-14(13)23-19-21-9-11-7-8-12-16(18(20)28)25-26(2)17(12)15(11)24-19/h3-6,9H,7-8H2,1-2H3,(H2,20,28)(H,22,27)(H,21,23,24)
NCI pathway
Reactome pathway
n/an/a>1.00E+4n/an/an/an/an/an/a
Nerviano Medical Sciences Srl
Curated by ChEMBL
Assay Description
Inhibition of Aurora A assessed as [33P]gamma-ATP incorporation into substrate after 60 mins by gamma counting
J Med Chem 53: 3532-51 (2010)
Article DOI: 10.1021/jm901713n
BindingDB Entry DOI: 10.7270/Q2RF5V5D
Serine/threonine-protein kinase PLK1
(Homo sapiens (Human))
BDBM50318064
(8-{[2-(Acetylamino)phenyl]amino}-1-methyl-4,5-dihy...)
Show SMILES CC(=O)Nc1ccccc1Nc1ncc2CCc3c(nn(C)c3-c2n1)C(N)=O
Show InChI InChI=1S/C19H19N7O2/c1-10(27)22-13-5-3-4-6-14(13)23-19-21-9-11-7-8-12-16(18(20)28)25-26(2)17(12)15(11)24-19/h3-6,9H,7-8H2,1-2H3,(H2,20,28)(H,22,27)(H,21,23,24)
NCI pathway
Reactome pathway
n/an/a 2.52E+3n/an/an/an/an/an/a
Nerviano Medical Sciences Srl
Curated by ChEMBL
Assay Description
Inhibition of GST-tagged PLK1 expressed in H5 insect cells assessed as [33P]gamma-ATP incorporation into substrate after 60 mins by gamma counting
J Med Chem 53: 3532-51 (2010)
Article DOI: 10.1021/jm901713n
BindingDB Entry DOI: 10.7270/Q2RF5V5D
Serine/threonine-protein kinase PLK2
(Homo sapiens (Human))
BDBM50318064
(8-{[2-(Acetylamino)phenyl]amino}-1-methyl-4,5-dihy...)
Show SMILES CC(=O)Nc1ccccc1Nc1ncc2CCc3c(nn(C)c3-c2n1)C(N)=O
Show InChI InChI=1S/C19H19N7O2/c1-10(27)22-13-5-3-4-6-14(13)23-19-21-9-11-7-8-12-16(18(20)28)25-26(2)17(12)15(11)24-19/h3-6,9H,7-8H2,1-2H3,(H2,20,28)(H,22,27)(H,21,23,24)
NCI pathway
n/an/a 2.10E+3n/an/an/an/an/an/a
Nerviano Medical Sciences Srl
Curated by ChEMBL
Assay Description
Inhibition of Plk2 assessed as [33P]gamma-ATP incorporation into substrate after 60 mins by gamma counting
J Med Chem 53: 3532-51 (2010)
Article DOI: 10.1021/jm901713n
BindingDB Entry DOI: 10.7270/Q2RF5V5D