BDBM50318087 8-(Phenylamino)-4,5-dihydro-1H-pyrazolo[4,3-h]quinazoline-3-carboxamide::CHEMBL1094401
SMILES: NC(=O)c1[nH]nc-2c1CCc1cnc(Nc3ccccc3)nc-21
InChI Key: InChIKey=ZYQXOZKYXADECC-UHFFFAOYSA-N
Data: 3 IC50
Activity Spreadsheet -- Enzyme Inhibition Constant Data from BindingDB
Found 3 hits for monomerid = 50318087
Trg + Lig
Ki
nM
ΔG°
kcal/mole
IC50
nM
Kd
nM
EC50/IC50
nM
koff
s-1
kon
M-1s-1
pHTemp
°C
CDK2/Cyclin A/Cyclin A1
(Homo sapiens (Human))
BDBM50318087
(8-(Phenylamino)-4,5-dihydro-1H-pyrazolo[4,3-h]quin...)
Show SMILES NC(=O)c1[nH]nc-2c1CCc1cnc(Nc3ccccc3)nc-21
Show InChI InChI=1S/C16H14N6O/c17-15(23)14-11-7-6-9-8-18-16(19-10-4-2-1-3-5-10)20-12(9)13(11)21-22-14/h1-5,8H,6-7H2,(H2,17,23)(H,21,22)(H,18,19,20)
Reactome pathway
n/an/a 2n/an/an/an/an/an/a
Nerviano Medical Sciences Srl
Curated by ChEMBL
Assay Description
Inhibition of CDK2/Cyclin A assessed as [33P]gamma-ATP incorporation into substrate after 60 mins by gamma counting
J Med Chem 53: 3532-51 (2010)
Article DOI: 10.1021/jm901713n
BindingDB Entry DOI: 10.7270/Q2RF5V5D
Serine/threonine-protein kinase PLK1
(Homo sapiens (Human))
BDBM50318087
(8-(Phenylamino)-4,5-dihydro-1H-pyrazolo[4,3-h]quin...)
Show SMILES NC(=O)c1[nH]nc-2c1CCc1cnc(Nc3ccccc3)nc-21
Show InChI InChI=1S/C16H14N6O/c17-15(23)14-11-7-6-9-8-18-16(19-10-4-2-1-3-5-10)20-12(9)13(11)21-22-14/h1-5,8H,6-7H2,(H2,17,23)(H,21,22)(H,18,19,20)
NCI pathway
Reactome pathway
n/an/a 248n/an/an/an/an/an/a
Nerviano Medical Sciences Srl
Curated by ChEMBL
Assay Description
Inhibition of GST-tagged PLK1 expressed in H5 insect cells assessed as [33P]gamma-ATP incorporation into substrate after 60 mins by gamma counting
J Med Chem 53: 3532-51 (2010)
Article DOI: 10.1021/jm901713n
BindingDB Entry DOI: 10.7270/Q2RF5V5D
Aurora kinase A
(Homo sapiens (Human))
BDBM50318087
(8-(Phenylamino)-4,5-dihydro-1H-pyrazolo[4,3-h]quin...)
Show SMILES NC(=O)c1[nH]nc-2c1CCc1cnc(Nc3ccccc3)nc-21
Show InChI InChI=1S/C16H14N6O/c17-15(23)14-11-7-6-9-8-18-16(19-10-4-2-1-3-5-10)20-12(9)13(11)21-22-14/h1-5,8H,6-7H2,(H2,17,23)(H,21,22)(H,18,19,20)
NCI pathway
Reactome pathway
n/an/a 92n/an/an/an/an/an/a
Nerviano Medical Sciences Srl
Curated by ChEMBL
Assay Description
Inhibition of Aurora A assessed as [33P]gamma-ATP incorporation into substrate after 60 mins by gamma counting
J Med Chem 53: 3532-51 (2010)
Article DOI: 10.1021/jm901713n
BindingDB Entry DOI: 10.7270/Q2RF5V5D