BDBM50318091 8-[(4-Methoxyphenyl)amino]-1-methyl-4,5-dihydro-1H-pyrazolo-[4,3-h]quinazoline-3-carboxamide::CHEMBL1094322
SMILES: COc1ccc(Nc2ncc3CCc4c(nn(C)c4-c3n2)C(N)=O)cc1
InChI Key: InChIKey=XCYGTFKOOGNUMR-UHFFFAOYSA-N
Data: 3 IC50
Activity Spreadsheet -- Enzyme Inhibition Constant Data from BindingDB
Found 3 hits for monomerid = 50318091
Trg + Lig
Ki
nM
ΔG°
kcal/mole
IC50
nM
Kd
nM
EC50/IC50
nM
koff
s-1
kon
M-1s-1
pHTemp
°C
CDK2/Cyclin A/Cyclin A1
(Homo sapiens (Human))
BDBM50318091
(8-[(4-Methoxyphenyl)amino]-1-methyl-4,5-dihydro-1H...)
Show SMILES COc1ccc(Nc2ncc3CCc4c(nn(C)c4-c3n2)C(N)=O)cc1
Show InChI InChI=1S/C18H18N6O2/c1-24-16-13(15(23-24)17(19)25)8-3-10-9-20-18(22-14(10)16)21-11-4-6-12(26-2)7-5-11/h4-7,9H,3,8H2,1-2H3,(H2,19,25)(H,20,21,22)
Reactome pathway
n/an/a 4n/an/an/an/an/an/a
Nerviano Medical Sciences Srl
Curated by ChEMBL
Assay Description
Inhibition of CDK2/Cyclin A assessed as [33P]gamma-ATP incorporation into substrate after 60 mins by gamma counting
J Med Chem 53: 3532-51 (2010)
Article DOI: 10.1021/jm901713n
BindingDB Entry DOI: 10.7270/Q2RF5V5D
Serine/threonine-protein kinase PLK1
(Homo sapiens (Human))
BDBM50318091
(8-[(4-Methoxyphenyl)amino]-1-methyl-4,5-dihydro-1H...)
Show SMILES COc1ccc(Nc2ncc3CCc4c(nn(C)c4-c3n2)C(N)=O)cc1
Show InChI InChI=1S/C18H18N6O2/c1-24-16-13(15(23-24)17(19)25)8-3-10-9-20-18(22-14(10)16)21-11-4-6-12(26-2)7-5-11/h4-7,9H,3,8H2,1-2H3,(H2,19,25)(H,20,21,22)
NCI pathway
Reactome pathway
n/an/a 256n/an/an/an/an/an/a
Nerviano Medical Sciences Srl
Curated by ChEMBL
Assay Description
Inhibition of GST-tagged PLK1 expressed in H5 insect cells assessed as [33P]gamma-ATP incorporation into substrate after 60 mins by gamma counting
J Med Chem 53: 3532-51 (2010)
Article DOI: 10.1021/jm901713n
BindingDB Entry DOI: 10.7270/Q2RF5V5D
Aurora kinase A
(Homo sapiens (Human))
BDBM50318091
(8-[(4-Methoxyphenyl)amino]-1-methyl-4,5-dihydro-1H...)
Show SMILES COc1ccc(Nc2ncc3CCc4c(nn(C)c4-c3n2)C(N)=O)cc1
Show InChI InChI=1S/C18H18N6O2/c1-24-16-13(15(23-24)17(19)25)8-3-10-9-20-18(22-14(10)16)21-11-4-6-12(26-2)7-5-11/h4-7,9H,3,8H2,1-2H3,(H2,19,25)(H,20,21,22)
NCI pathway
Reactome pathway
n/an/a 128n/an/an/an/an/an/a
Nerviano Medical Sciences Srl
Curated by ChEMBL
Assay Description
Inhibition of Aurora A assessed as [33P]gamma-ATP incorporation into substrate after 60 mins by gamma counting
J Med Chem 53: 3532-51 (2010)
Article DOI: 10.1021/jm901713n
BindingDB Entry DOI: 10.7270/Q2RF5V5D