BDBM50318130 4-[(14S)-16-amino-14-cyclohexyl-11-oxo-2-oxa-10,15,17-triazatetracyclo[13.5.3.1^{3,7}.0^{18,22}]tetracosa-1(21),3(24),4,6,16,18(22),19-heptaen-10-yl]cyclohexane-1-carboxylic acid::CHEMBL1097282
SMILES: NC1=Nc2ccc3Oc4cccc(CCN([C@H]5CC[C@@H](CC5)C(O)=O)C(=O)CC[C@@H](C5CCCCC5)N1Cc2c3)c4
InChI Key: InChIKey=ZNEWKHBAQIYKKP-QECWJDIYSA-N
Data: 1 KI  1 IC50
Activity Spreadsheet -- Enzyme Inhibition Constant Data from BindingDB
Found 2 hits for monomerid = 50318130
Trg + Lig
Ki
nM
ΔG°
kcal/mole
IC50
nM
Kd
nM
EC50/IC50
nM
koff
s-1
kon
M-1s-1
pHTemp
°C
Beta-secretase 1
(Homo sapiens (Human))
BDBM50318130
(4-[(14S)-16-amino-14-cyclohexyl-11-oxo-2-oxa-10,15...)
Show SMILES NC1=Nc2ccc3Oc4cccc(CCN([C@H]5CC[C@@H](CC5)C(O)=O)C(=O)CC[C@@H](C5CCCCC5)N1Cc2c3)c4 |r,wU:29.30,19.22,wD:16.15,t:1,(5.63,-16.54,;4.29,-15.78,;2.95,-16.55,;1.62,-15.78,;.29,-16.55,;-1.05,-15.78,;-1.04,-14.24,;-2.38,-13.45,;-2.37,-11.98,;-3.7,-11.21,;-3.7,-9.67,;-2.37,-8.9,;-1.04,-9.66,;.39,-8.91,;1.74,-9.72,;3.12,-8.97,;3.15,-7.43,;4.51,-6.7,;4.54,-5.17,;3.23,-4.36,;1.88,-5.09,;1.84,-6.64,;3.27,-2.82,;4.63,-2.08,;1.96,-2.01,;4.45,-9.78,;5.8,-9.04,;4.42,-11.35,;5.73,-12.15,;5.69,-13.6,;6.96,-14.46,;6.98,-15.99,;8.31,-16.74,;9.63,-15.96,;9.62,-14.42,;8.28,-13.66,;4.29,-14.23,;2.95,-13.46,;1.62,-14.23,;.28,-13.47,;-1.03,-11.21,)|
Show InChI InChI=1S/C33H42N4O4/c34-33-35-29-14-13-28-20-25(29)21-37(33)30(23-6-2-1-3-7-23)15-16-31(38)36(26-11-9-24(10-12-26)32(39)40)18-17-22-5-4-8-27(19-22)41-28/h4-5,8,13-14,19-20,23-24,26,30H,1-3,6-7,9-12,15-18,21H2,(H2,34,35)(H,39,40)/t24-,26-,30-/m0/s1
>1.00E+3n/an/an/an/an/an/an/an/a
Johnson& Johnson Pharmaceutical Research& Development
Curated by ChEMBL
Assay Description
Inhibition of BACE1
Bioorg Med Chem Lett 20: 3158-60 (2010)
Article DOI: 10.1016/j.bmcl.2010.03.097
BindingDB Entry DOI: 10.7270/Q2C53M1S
Beta-secretase 1
(Homo sapiens (Human))
BDBM50318130
(4-[(14S)-16-amino-14-cyclohexyl-11-oxo-2-oxa-10,15...)
Show SMILES NC1=Nc2ccc3Oc4cccc(CCN([C@H]5CC[C@@H](CC5)C(O)=O)C(=O)CC[C@@H](C5CCCCC5)N1Cc2c3)c4 |r,wU:29.30,19.22,wD:16.15,t:1,(5.63,-16.54,;4.29,-15.78,;2.95,-16.55,;1.62,-15.78,;.29,-16.55,;-1.05,-15.78,;-1.04,-14.24,;-2.38,-13.45,;-2.37,-11.98,;-3.7,-11.21,;-3.7,-9.67,;-2.37,-8.9,;-1.04,-9.66,;.39,-8.91,;1.74,-9.72,;3.12,-8.97,;3.15,-7.43,;4.51,-6.7,;4.54,-5.17,;3.23,-4.36,;1.88,-5.09,;1.84,-6.64,;3.27,-2.82,;4.63,-2.08,;1.96,-2.01,;4.45,-9.78,;5.8,-9.04,;4.42,-11.35,;5.73,-12.15,;5.69,-13.6,;6.96,-14.46,;6.98,-15.99,;8.31,-16.74,;9.63,-15.96,;9.62,-14.42,;8.28,-13.66,;4.29,-14.23,;2.95,-13.46,;1.62,-14.23,;.28,-13.47,;-1.03,-11.21,)|
Show InChI InChI=1S/C33H42N4O4/c34-33-35-29-14-13-28-20-25(29)21-37(33)30(23-6-2-1-3-7-23)15-16-31(38)36(26-11-9-24(10-12-26)32(39)40)18-17-22-5-4-8-27(19-22)41-28/h4-5,8,13-14,19-20,23-24,26,30H,1-3,6-7,9-12,15-18,21H2,(H2,34,35)(H,39,40)/t24-,26-,30-/m0/s1
n/an/a>1.00E+3n/an/an/an/an/an/a
Johnson& Johnson Pharmaceutical Research& Development
Curated by ChEMBL
Assay Description
Inhibition of BACE1 assessed as amyloid beta (1-40) production
Bioorg Med Chem Lett 20: 3158-60 (2010)
Article DOI: 10.1016/j.bmcl.2010.03.097
BindingDB Entry DOI: 10.7270/Q2C53M1S