BDBM50318473 2-methyl-1-(thiophen-3-yl)pent-1-en-3-one oxime::CHEMBL1085944
SMILES: CCC(N=O)C(C)=Cc1ccsc1
InChI Key: InChIKey=MTERIVIYUVDTBU-UHFFFAOYSA-N
Data: 1 IC50
Activity Spreadsheet -- Enzyme Inhibition Constant Data from BindingDB
Found 1 hit for monomerid = 50318473
Trg + Lig
Ki
nM
ΔG°
kcal/mole
IC50
nM
Kd
nM
EC50/IC50
nM
koff
s-1
kon
M-1s-1
pHTemp
°C
Transient receptor potential cation channel subfamily A member 1
(Homo sapiens (Human))
BDBM50318473
(2-methyl-1-(thiophen-3-yl)pent-1-en-3-one oxime | ...)
Show SMILES CCC(N=O)C(C)=Cc1ccsc1 |w:7.7|
Show InChI InChI=1S/C10H13NOS/c1-3-10(11-12)8(2)6-9-4-5-13-7-9/h4-7,10H,3H2,1-2H3
n/an/a 1.32E+3n/an/an/an/an/an/a
Ferrara University
Curated by ChEMBL
Assay Description
Antagonist activity at human TRPA1 channel expressed in CHO cells assessed as inhibition of cinnamaldehyde-induced intracellular calcium influx
J Med Chem 53: 5085-107 (2010)
Article DOI: 10.1021/jm100062h
BindingDB Entry DOI: 10.7270/Q2416Z02