BDBM50318491 7-((1R,2S)-2-((S)-3-hydroxyoct-1-enyl)-5-oxocyclopent-3-enyl)heptanoic acid::CHEMBL1084644
SMILES: CCCCC[C@H](O)C=C[C@H]1C=CC(=O)[C@@H]1CCCCCCC(O)=O
InChI Key: InChIKey=BGKHCLZFGPIKKU-OKZBNKHCSA-N
Data: 1 KI  1 EC50
Activity Spreadsheet -- Enzyme Inhibition Constant Data from BindingDB
Found 2 hits for monomerid = 50318491
Trg + Lig
Ki
nM
ΔG°
kcal/mole
IC50
nM
Kd
nM
EC50/IC50
nM
koff
s-1
kon
M-1s-1
pHTemp
°C
Prostaglandin transporter (PGT)
(Rattus norvegicus (Rat))
BDBM50318491
(7-((1R,2S)-2-((S)-3-hydroxyoct-1-enyl)-5-oxocyclop...)
Show SMILES CCCCC[C@H](O)C=C[C@H]1C=CC(=O)[C@@H]1CCCCCCC(O)=O |r,c:10|
Show InChI InChI=1S/C20H32O4/c1-2-3-6-9-17(21)14-12-16-13-15-19(22)18(16)10-7-4-5-8-11-20(23)24/h12-18,21H,2-11H2,1H3,(H,23,24)/t16-,17-,18+/m0/s1
286n/an/an/an/an/an/an/an/a
Albert Einstein College of Medicine
Curated by ChEMBL
Assay Description
TP_TRANSPORTER: inhibition of PGE2 uptake in PGT-expressing HeLa cells
Mol Pharmacol 50: 738-42 (1996)
BindingDB Entry DOI: 10.7270/Q2MW2J7P
Transient receptor potential cation channel subfamily A member 1
(Homo sapiens (Human))
BDBM50318491
(7-((1R,2S)-2-((S)-3-hydroxyoct-1-enyl)-5-oxocyclop...)
Show SMILES CCCCC[C@H](O)C=C[C@H]1C=CC(=O)[C@@H]1CCCCCCC(O)=O |r,c:10|
Show InChI InChI=1S/C20H32O4/c1-2-3-6-9-17(21)14-12-16-13-15-19(22)18(16)10-7-4-5-8-11-20(23)24/h12-18,21H,2-11H2,1H3,(H,23,24)/t16-,17-,18+/m0/s1
n/an/an/an/a 1.51E+4n/an/an/an/a
Ferrara University
Curated by ChEMBL
Assay Description
Activation of TRPA1 channel
J Med Chem 53: 5085-107 (2010)
Article DOI: 10.1021/jm100062h
BindingDB Entry DOI: 10.7270/Q2416Z02