null
SMILES: COc1ccc(cc1)-c1nc2ncc(Br)c(N3CCN(Cc4cscn4)CC3)c2[nH]1
InChI Key: InChIKey=NTHPWFWTUVCOKW-UHFFFAOYSA-N
Activity Spreadsheet -- Enzyme Inhibition Constant Data from BindingDB
Found 1 hit for monomerid = 50318601
Trg + Lig
Ki
nM
ΔG°
kcal/mole
IC50
nM
Kd
nM
EC50/IC50
nM
koff
s-1
kon
M-1s-1
pHTemp
°C
Aurora kinase A
(Homo sapiens (Human))
BDBM50318601
(4-((4-(6-Bromo-2-(4-methoxyphenyl)-3H-imidazo[4,5-...)
Show SMILES COc1ccc(cc1)-c1nc2ncc(Br)c(N3CCN(Cc4cscn4)CC3)c2[nH]1
Show InChI InChI=1S/C21H21BrN6OS/c1-29-16-4-2-14(3-5-16)20-25-18-19(17(22)10-23-21(18)26-20)28-8-6-27(7-9-28)11-15-12-30-13-24-15/h2-5,10,12-13H,6-9,11H2,1H3,(H,23,25,26)
NCI pathway
Reactome pathway
n/an/a 4n/an/an/an/an/an/a
Institute of Cancer Research
Curated by ChEMBL
Assay Description
Inhibition of human recombinant Aurora A expressed in baculovirus system
J Med Chem 53: 5213-28 (2010)
Article DOI: 10.1021/jm100262j
BindingDB Entry DOI: 10.7270/Q2GB251P