BDBM50319009 6-(5-chloro-3-methylbenzo[b]thiophen-2-yl)pyrimidin-4-amine::CHEMBL1085468
SMILES: Cc1c(sc2ccc(Cl)cc12)-c1cc(N)ncn1
InChI Key: InChIKey=MJTUXRNGKNHNAW-UHFFFAOYSA-N
Data: 1 IC50
Activity Spreadsheet -- Enzyme Inhibition Constant Data from BindingDB
Found 1 hit for monomerid = 50319009
Trg + Lig
Ki
nM
ΔG°
kcal/mole
IC50
nM
Kd
nM
EC50/IC50
nM
koff
s-1
kon
M-1s-1
pHTemp
°C
Rho-associated protein kinase 1
(Homo sapiens (Human))
BDBM50319009
(6-(5-chloro-3-methylbenzo[b]thiophen-2-yl)pyrimidi...)
Show SMILES Cc1c(sc2ccc(Cl)cc12)-c1cc(N)ncn1
Show InChI InChI=1S/C13H10ClN3S/c1-7-9-4-8(14)2-3-11(9)18-13(7)10-5-12(15)17-6-16-10/h2-6H,1H3,(H2,15,16,17)
NCI pathway
Reactome pathway
n/an/a 1.30E+4n/an/an/an/an/an/a
Kalypsys, Inc.
Curated by ChEMBL
Assay Description
Inhibition of ROCK1 assessed as ATP cunsumption
Bioorg Med Chem Lett 20: 3361-6 (2010)
Article DOI: 10.1016/j.bmcl.2010.04.020
BindingDB Entry DOI: 10.7270/Q289161H